BDBM50355941 CHEMBL1910409
SMILES: CCCN[C@H]1C[C@H](Nc2ccc(cc12)[N+]([O-])=O)C(C)(C)CO
InChI Key: InChIKey=OSMKOXYALPBEOJ-GJZGRUSLSA-N
Data: 1 IC50
Activity Spreadsheet -- Enzyme Inhibition Constant Data from BindingDB
Found 1 hit for monomerid = 50355941
Trg + Lig
Ki
nM
ΔG°
kcal/mole
IC50
nM
Kd
nM
EC50/IC50
nM
koff
s-1
kon
M-1s-1
pHTemp
°C
Androgen receptor
(Rattus norvegicus (Rat))
BDBM50355941
(CHEMBL1910409)
Show SMILES CCCN[C@H]1C[C@H](Nc2ccc(cc12)[N+]([O-])=O)C(C)(C)CO |r|
Show InChI InChI=1S/C16H25N3O3/c1-4-7-17-14-9-15(16(2,3)10-20)18-13-6-5-11(19(21)22)8-12(13)14/h5-6,8,14-15,17-18,20H,4,7,9-10H2,1-3H3/t14-,15-/m0/s1
Reactome pathway
n/an/a>1.00E+3n/an/an/an/an/an/a
Kaken Pharmaceutical Co., Ltd
Curated by ChEMBL
Assay Description
Competitive binding affinity to rat androgen receptor
Bioorg Med Chem Lett 21: 6310-3 (2011)
Checked by Author
Article DOI: 10.1016/j.bmcl.2011.08.118
BindingDB Entry DOI: 10.7270/Q2JH3MKZ