BDBM50357647 CHEMBL1914737
SMILES: CN(C)c1cnc2ccc(cc2n1)-c1cnc(Cl)c(NS(=O)(=O)c2ccc(F)cc2)c1
InChI Key: InChIKey=SFNZMGFKQRJYOV-UHFFFAOYSA-N
Data: 1 KI  1 IC50
Activity Spreadsheet -- Enzyme Inhibition Constant Data from BindingDB
Found 2 hits for monomerid = 50357647
Trg + Lig
Ki
nM
ΔG°
kcal/mole
IC50
nM
Kd
nM
EC50/IC50
nM
koff
s-1
kon
M-1s-1
pHTemp
°C
Phosphatidylinositol 4,5-bisphosphate 3-kinase catalytic subunit alpha isoform
(Homo sapiens (Human))
BDBM50357647
(CHEMBL1914737)
Show SMILES CN(C)c1cnc2ccc(cc2n1)-c1cnc(Cl)c(NS(=O)(=O)c2ccc(F)cc2)c1
Show InChI InChI=1S/C21H17ClFN5O2S/c1-28(2)20-12-24-17-8-3-13(9-18(17)26-20)14-10-19(21(22)25-11-14)27-31(29,30)16-6-4-15(23)5-7-16/h3-12,27H,1-2H3
NCI pathway
Reactome pathway
1.70n/an/an/an/an/an/an/an/a
Amgen Inc.
Curated by ChEMBL
Assay Description
Inhibition of N-terminus polyHis-tagged human recombinant PI3Kalpha expressed in baculovirus infected insect Sf9 cells using phosphoinositol-4,5-bisp...
J Med Chem 54: 4735-51 (2011)
Article DOI: 10.1021/jm200386s
BindingDB Entry DOI: 10.7270/Q2FB53C5
Phosphatidylinositol 4,5-bisphosphate 3-kinase catalytic subunit alpha isoform
(Homo sapiens (Human))
BDBM50357647
(CHEMBL1914737)
Show SMILES CN(C)c1cnc2ccc(cc2n1)-c1cnc(Cl)c(NS(=O)(=O)c2ccc(F)cc2)c1
Show InChI InChI=1S/C21H17ClFN5O2S/c1-28(2)20-12-24-17-8-3-13(9-18(17)26-20)14-10-19(21(22)25-11-14)27-31(29,30)16-6-4-15(23)5-7-16/h3-12,27H,1-2H3
NCI pathway
Reactome pathway
n/an/a 44n/an/an/an/an/an/a
Amgen Inc.
Curated by ChEMBL
Assay Description
Inhibition of PI3Kalpha-mediated Akt phosphorylation at Ser 473 in human U87MG cells
J Med Chem 54: 4735-51 (2011)
Article DOI: 10.1021/jm200386s
BindingDB Entry DOI: 10.7270/Q2FB53C5