BDBM50357673 CHEMBL1914738
SMILES: Fc1ccc(cc1)S(=O)(=O)Nc1cc(cnc1Cl)-c1ccc2ncc(nc2c1)N1CCCCC1
InChI Key: InChIKey=CITYVTFEGMZZGV-UHFFFAOYSA-N
Data: 1 KI  1 IC50
Activity Spreadsheet -- Enzyme Inhibition Constant Data from BindingDB
Found 2 hits for monomerid = 50357673
Trg + Lig
Ki
nM
ΔG°
kcal/mole
IC50
nM
Kd
nM
EC50/IC50
nM
koff
s-1
kon
M-1s-1
pHTemp
°C
Phosphatidylinositol 4,5-bisphosphate 3-kinase catalytic subunit alpha isoform
(Homo sapiens (Human))
BDBM50357673
(CHEMBL1914738)
Show SMILES Fc1ccc(cc1)S(=O)(=O)Nc1cc(cnc1Cl)-c1ccc2ncc(nc2c1)N1CCCCC1
Show InChI InChI=1S/C24H21ClFN5O2S/c25-24-22(30-34(32,33)19-7-5-18(26)6-8-19)13-17(14-28-24)16-4-9-20-21(12-16)29-23(15-27-20)31-10-2-1-3-11-31/h4-9,12-15,30H,1-3,10-11H2
NCI pathway
Reactome pathway
0.900n/an/an/an/an/an/an/an/a
Amgen Inc.
Curated by ChEMBL
Assay Description
Inhibition of N-terminus polyHis-tagged human recombinant PI3Kalpha expressed in baculovirus infected insect Sf9 cells using phosphoinositol-4,5-bisp...
J Med Chem 54: 4735-51 (2011)
Article DOI: 10.1021/jm200386s
BindingDB Entry DOI: 10.7270/Q2FB53C5
Phosphatidylinositol 4,5-bisphosphate 3-kinase catalytic subunit alpha isoform
(Homo sapiens (Human))
BDBM50357673
(CHEMBL1914738)
Show SMILES Fc1ccc(cc1)S(=O)(=O)Nc1cc(cnc1Cl)-c1ccc2ncc(nc2c1)N1CCCCC1
Show InChI InChI=1S/C24H21ClFN5O2S/c25-24-22(30-34(32,33)19-7-5-18(26)6-8-19)13-17(14-28-24)16-4-9-20-21(12-16)29-23(15-27-20)31-10-2-1-3-11-31/h4-9,12-15,30H,1-3,10-11H2
NCI pathway
Reactome pathway
n/an/a 128n/an/an/an/an/an/a
Amgen Inc.
Curated by ChEMBL
Assay Description
Inhibition of PI3Kalpha-mediated Akt phosphorylation at Ser 473 in human U87MG cells
J Med Chem 54: 4735-51 (2011)
Article DOI: 10.1021/jm200386s
BindingDB Entry DOI: 10.7270/Q2FB53C5