BDBM50357728 CHEMBL1915985
SMILES: CC(C)C[C@]1(CCN([C@@H](CCc2ccccc2)C(=O)N[C@@H](Cc2cc(F)cc(F)c2)[C@H](O)[C@H]2Cc3ccccc3CN2)C1=O)NC(C)=O
InChI Key: InChIKey=JJJDOYFRIVNWHV-WUCUQKTKSA-N
Data: 2 IC50
PDB links: 1 PDB ID matches this monomer.
Activity Spreadsheet -- Enzyme Inhibition Constant Data from BindingDB
Found 2 hits for monomerid = 50357728
Trg + Lig
Ki
nM
ΔG°
kcal/mole
IC50
nM
Kd
nM
EC50/IC50
nM
koff
s-1
kon
M-1s-1
pHTemp
°C
Beta-secretase 1
(Homo sapiens (Human))
BDBM50357728
(CHEMBL1915985)
Show SMILES CC(C)C[C@]1(CCN([C@@H](CCc2ccccc2)C(=O)N[C@@H](Cc2cc(F)cc(F)c2)[C@H](O)[C@H]2Cc3ccccc3CN2)C1=O)NC(C)=O |r|
Show InChI InChI=1S/C38H46F2N4O4/c1-24(2)22-38(43-25(3)45)15-16-44(37(38)48)34(14-13-26-9-5-4-6-10-26)36(47)42-33(19-27-17-30(39)21-31(40)18-27)35(46)32-20-28-11-7-8-12-29(28)23-41-32/h4-12,17-18,21,24,32-35,41,46H,13-16,19-20,22-23H2,1-3H3,(H,42,47)(H,43,45)/t32-,33+,34+,35-,38+/m1/s1
n/an/a 9.5n/an/an/an/an/an/a
Bristol-Myers Squibb
Curated by ChEMBL
Assay Description
Inhibition of BACE1 in human HEK293 cells expressing swedish mutant APP
Bioorg Med Chem Lett 21: 6916-24 (2011)
Article DOI: 10.1016/j.bmcl.2011.06.109
BindingDB Entry DOI: 10.7270/Q2J38T0K
3D
3D Structure (crystal)
Beta-secretase 1
(Homo sapiens (Human))
BDBM50357728
(CHEMBL1915985)
Show SMILES CC(C)C[C@]1(CCN([C@@H](CCc2ccccc2)C(=O)N[C@@H](Cc2cc(F)cc(F)c2)[C@H](O)[C@H]2Cc3ccccc3CN2)C1=O)NC(C)=O |r|
Show InChI InChI=1S/C38H46F2N4O4/c1-24(2)22-38(43-25(3)45)15-16-44(37(38)48)34(14-13-26-9-5-4-6-10-26)36(47)42-33(19-27-17-30(39)21-31(40)18-27)35(46)32-20-28-11-7-8-12-29(28)23-41-32/h4-12,17-18,21,24,32-35,41,46H,13-16,19-20,22-23H2,1-3H3,(H,42,47)(H,43,45)/t32-,33+,34+,35-,38+/m1/s1
n/an/a 8.60n/an/an/an/an/an/a
Bristol-Myers Squibb
Curated by ChEMBL
Assay Description
Inhibition of BACE1 by HPLC method
Bioorg Med Chem Lett 21: 6916-24 (2011)
Article DOI: 10.1016/j.bmcl.2011.06.109
BindingDB Entry DOI: 10.7270/Q2J38T0K
3D
3D Structure (crystal)