BDBM50358220 CHEMBL455389
SMILES: CC[C@H](CO)Nc1nc(NCc2cccnc2)c2ncn(C(C)C)c2n1
InChI Key: InChIKey=ITWHOUBMQIJNKR-CQSZACIVSA-N
Data: 4 IC50  1 EC50
Activity Spreadsheet -- Enzyme Inhibition Constant Data from BindingDB
Found 5 hits for monomerid = 50358220
Trg + Lig
Ki
nM
ΔG°
kcal/mole
IC50
nM
Kd
nM
EC50/IC50
nM
koff
s-1
kon
M-1s-1
pHTemp
°C
Cyclin-Dependent Kinase 7 (CDK7)
(Homo sapiens (Human))
BDBM50358220
(CHEMBL455389)
Show SMILES CC[C@H](CO)Nc1nc(NCc2cccnc2)c2ncn(C(C)C)c2n1 |r|
Show InChI InChI=1S/C18H25N7O/c1-4-14(10-26)22-18-23-16(20-9-13-6-5-7-19-8-13)15-17(24-18)25(11-21-15)12(2)3/h5-8,11-12,14,26H,4,9-10H2,1-3H3,(H2,20,22,23,24)/t14-/m1/s1
NCI pathway
Reactome pathway
n/an/a 180n/an/an/an/an/an/a
Institute of Cancer Research
Curated by ChEMBL
Assay Description
Inhibition of CDK7/cyclin H
Bioorg Med Chem 19: 6949-65 (2011)
Article DOI: 10.1016/j.bmc.2011.08.051
BindingDB Entry DOI: 10.7270/Q2NP24V1
Mitogen-activated protein kinase 1
(Homo sapiens (Human))
BDBM50358220
(CHEMBL455389)
Show SMILES CC[C@H](CO)Nc1nc(NCc2cccnc2)c2ncn(C(C)C)c2n1 |r|
Show InChI InChI=1S/C18H25N7O/c1-4-14(10-26)22-18-23-16(20-9-13-6-5-7-19-8-13)15-17(24-18)25(11-21-15)12(2)3/h5-8,11-12,14,26H,4,9-10H2,1-3H3,(H2,20,22,23,24)/t14-/m1/s1
NCI pathway
Reactome pathway
n/an/a 2.40E+4n/an/an/an/an/an/a
Institute of Cancer Research
Curated by ChEMBL
Assay Description
Inhibition of ERK2
Bioorg Med Chem 19: 6949-65 (2011)
Article DOI: 10.1016/j.bmc.2011.08.051
BindingDB Entry DOI: 10.7270/Q2NP24V1
Glycogen synthase kinase-3
(Sus scrofa)
BDBM50358220
(CHEMBL455389)
Show SMILES CC[C@H](CO)Nc1nc(NCc2cccnc2)c2ncn(C(C)C)c2n1 |r|
Show InChI InChI=1S/C18H25N7O/c1-4-14(10-26)22-18-23-16(20-9-13-6-5-7-19-8-13)15-17(24-18)25(11-21-15)12(2)3/h5-8,11-12,14,26H,4,9-10H2,1-3H3,(H2,20,22,23,24)/t14-/m1/s1
n/an/a>1.00E+4n/an/an/an/an/an/a
Universite Paris-Descartes
Curated by ChEMBL
Assay Description
Inhibition of pig brain GSK3alpha/beta
J Med Chem 51: 5229-42 (2008)
Article DOI: 10.1021/jm800109e
BindingDB Entry DOI: 10.7270/Q2DB84PF
Voltage-gated calcium channel subunit alpha Cav2.2
(Homo sapiens (Human))
BDBM50358220
(CHEMBL455389)
Show SMILES CC[C@H](CO)Nc1nc(NCc2cccnc2)c2ncn(C(C)C)c2n1 |r|
Show InChI InChI=1S/C18H25N7O/c1-4-14(10-26)22-18-23-16(20-9-13-6-5-7-19-8-13)15-17(24-18)25(11-21-15)12(2)3/h5-8,11-12,14,26H,4,9-10H2,1-3H3,(H2,20,22,23,24)/t14-/m1/s1
n/an/an/an/a>1.00E+5n/an/an/an/a
TBA
Curated by ChEMBL
Assay Description
Agonist activity at N-type Cav2.2 channel expressed in tsA201 cell assessed as calcium current by whole-cell patch clamp method
ACS Med Chem Lett 3: 985-990 (2012)
Article DOI: 10.1021/ml3002083
BindingDB Entry DOI: 10.7270/Q2BC40P0
Cyclin-Dependent Kinase 1 (CDK1)
(Homo sapiens (Human))
BDBM50358220
(CHEMBL455389)
Show SMILES CC[C@H](CO)Nc1nc(NCc2cccnc2)c2ncn(C(C)C)c2n1 |r|
Show InChI InChI=1S/C18H25N7O/c1-4-14(10-26)22-18-23-16(20-9-13-6-5-7-19-8-13)15-17(24-18)25(11-21-15)12(2)3/h5-8,11-12,14,26H,4,9-10H2,1-3H3,(H2,20,22,23,24)/t14-/m1/s1
Reactome pathway
n/an/a 7.40E+3n/an/an/an/an/an/a
Institute of Cancer Research
Curated by ChEMBL
Assay Description
Inhibition of CDK1/cyclin B
Bioorg Med Chem 19: 6949-65 (2011)
Article DOI: 10.1016/j.bmc.2011.08.051
BindingDB Entry DOI: 10.7270/Q2NP24V1