BDBM50358412 CHEMBL1922850
SMILES: CCCCCCCCC(=O)[C@@H](O)CC
InChI Key: InChIKey=XWVPMEADCKKVQX-NSHDSACASA-N
Data: 1 EC50
Activity Spreadsheet -- Enzyme Inhibition Constant Data from BindingDB
Found 1 hit for monomerid = 50358412
Trg + Lig
Ki
nM
ΔG°
kcal/mole
IC50
nM
Kd
nM
EC50/IC50
nM
koff
s-1
kon
M-1s-1
pHTemp
°C
CAI-1 autoinducer sensor kinase/phosphatase CqsS
(Vibrio cholerae serotype O1 (strain ATCC 39315 / E...)
BDBM50358412
(CHEMBL1922850)
Show SMILES CCCCCCCCC(=O)[C@@H](O)CC |r|
Show InChI InChI=1S/C12H24O2/c1-3-5-6-7-8-9-10-12(14)11(13)4-2/h11,13H,3-10H2,1-2H3/t11-/m0/s1
n/an/an/an/a 1.10E+3n/an/an/an/a
Princeton University
Curated by ChEMBL
Assay Description
Agonist activity at CqsS receptor in cqsA-deficient, luxQ-deficient Vibrio cholerae MM920 harboring cosmid pBB1 carrying Vibrio harveyi luxCDABE gene...
Bioorg Med Chem 19: 6906-18 (2011)
Article DOI: 10.1016/j.bmc.2011.09.021
BindingDB Entry DOI: 10.7270/Q27H1K1T