BDBM50359218 CHEMBL1923313
SMILES: CCN1C2=NC(C)(C)CN2c2c(nc(-c3ccc(nc3)-c3ccccc3)n2Cc2ccc(F)c(F)c2)C1=O
InChI Key: InChIKey=QCSJAJJSOKTXDE-UHFFFAOYSA-N
Data: 1 IC50
Activity Spreadsheet -- Enzyme Inhibition Constant Data from BindingDB
Found 1 hit for monomerid = 50359218
Trg + Lig
Ki
nM
ΔG°
kcal/mole
IC50
nM
Kd
nM
EC50/IC50
nM
koff
s-1
kon
M-1s-1
pHTemp
°C
P2X purinoceptor 7
(Homo sapiens (Human))
BDBM50359218
(CHEMBL1923313)
Show SMILES CCN1C2=NC(C)(C)CN2c2c(nc(-c3ccc(nc3)-c3ccccc3)n2Cc2ccc(F)c(F)c2)C1=O |t:3|
Show InChI InChI=1S/C29H26F2N6O/c1-4-35-27(38)24-26(37-17-29(2,3)34-28(35)37)36(16-18-10-12-21(30)22(31)14-18)25(33-24)20-11-13-23(32-15-20)19-8-6-5-7-9-19/h5-15H,4,16-17H2,1-3H3
n/an/a 24n/an/an/an/an/an/a
Merck Research Laboratories
Curated by ChEMBL
Assay Description
Antagonist activity at P2X7 receptor in LPS-stimulated human whole blood assessed as inhibition of ATP-induced IL1-beta production treated 30 mins be...
Bioorg Med Chem Lett 21: 7287-90 (2011)
Article DOI: 10.1016/j.bmcl.2011.10.037
BindingDB Entry DOI: 10.7270/Q2DV1K8Z