BDBM50360830 CHEMBL1934808
SMILES: COc1nc2cc(Br)ccc2c2nc([nH]c12)-c1ccccc1Cl
InChI Key: InChIKey=QTHYAWBUGINVLE-UHFFFAOYSA-N
Data: 2 IC50
Activity Spreadsheet -- Enzyme Inhibition Constant Data from BindingDB
Found 2 hits for monomerid = 50360830
Trg + Lig
Ki
nM
ΔG°
kcal/mole
IC50
nM
Kd
nM
EC50/IC50
nM
koff
s-1
kon
M-1s-1
pHTemp
°C
Prostaglandin E synthase
(Homo sapiens (Human))
BDBM50360830
(CHEMBL1934808)
Show SMILES COc1nc2cc(Br)ccc2c2nc([nH]c12)-c1ccccc1Cl
Show InChI InChI=1S/C17H11BrClN3O/c1-23-17-15-14(11-7-6-9(18)8-13(11)20-17)21-16(22-15)10-4-2-3-5-12(10)19/h2-8H,1H3,(H,21,22)
Reactome pathway
n/an/a 62n/an/an/an/an/an/a
Dainippon Sumitomo Pharma. Co. Ltd
Curated by ChEMBL
Assay Description
Inhibition of microsomal PGES1 transfected in human HEK293 cells assessed as PGE2 production after 60 mins by HTRF assay
Bioorg Med Chem Lett 22: 285-8 (2011)
Article DOI: 10.1016/j.bmcl.2011.11.015
BindingDB Entry DOI: 10.7270/Q2PR7WFN
Prostaglandin E synthase
(Homo sapiens (Human))
BDBM50360830
(CHEMBL1934808)
Show SMILES COc1nc2cc(Br)ccc2c2nc([nH]c12)-c1ccccc1Cl
Show InChI InChI=1S/C17H11BrClN3O/c1-23-17-15-14(11-7-6-9(18)8-13(11)20-17)21-16(22-15)10-4-2-3-5-12(10)19/h2-8H,1H3,(H,21,22)
Reactome pathway
n/an/a 60n/an/an/an/an/an/a
University of Innsbruck
Curated by ChEMBL
Assay Description
Inhibition of mPGES-1 in IL-1beta-stimulated human A549 cell microsomal membranes assessed as reduction in PGE2 formation incubated for 15 mins using...
Bioorg Med Chem 23: 4839-45 (2015)
BindingDB Entry DOI: 10.7270/Q2M90BF8