BDBM50361620 CHEMBL1939862
SMILES: CCOC(=O)c1cc2cc(ccc2[nH]1)C(N)=O
InChI Key: InChIKey=HNSDWMLOQWSYEZ-UHFFFAOYSA-N
Data: 3 IC50
PDB links: 1 PDB ID matches this monomer.
Activity Spreadsheet -- Enzyme Inhibition Constant Data from BindingDB
Found 3 hits for monomerid = 50361620
Trg + Lig
Ki
nM
ΔG°
kcal/mole
IC50
nM
Kd
nM
EC50/IC50
nM
koff
s-1
kon
M-1s-1
pHTemp
°C
Matrix metalloproteinase-14 (MMP14)
(Homo sapiens (Human))
BDBM50361620
(CHEMBL1939862)
Show SMILES CCOC(=O)c1cc2cc(ccc2[nH]1)C(N)=O
Show InChI InChI=1S/C12H12N2O3/c1-2-17-12(16)10-6-8-5-7(11(13)15)3-4-9(8)14-10/h3-6,14H,2H2,1H3,(H2,13,15)
n/an/a>5.00E+5n/an/an/an/an/an/a
Boehringer Ingelheim Pharmaceuticals Inc
Curated by ChEMBL
Assay Description
Inhibition of human recombinant MMP14 after 60 mins by fluorimetry
J Med Chem 54: 8174-87 (2011)
Article DOI: 10.1021/jm201129m
BindingDB Entry DOI: 10.7270/Q2C53M9C
72 kDa type IV collagenase
(Homo sapiens (Human))
BDBM50361620
(CHEMBL1939862)
Show SMILES CCOC(=O)c1cc2cc(ccc2[nH]1)C(N)=O
Show InChI InChI=1S/C12H12N2O3/c1-2-17-12(16)10-6-8-5-7(11(13)15)3-4-9(8)14-10/h3-6,14H,2H2,1H3,(H2,13,15)
Reactome pathway
n/an/a 6.00E+4n/an/an/an/an/an/a
Boehringer Ingelheim Pharmaceuticals Inc
Curated by ChEMBL
Assay Description
Inhibition of human recombinant MMP2 after 30 mins by fluorimetry
J Med Chem 54: 8174-87 (2011)
Article DOI: 10.1021/jm201129m
BindingDB Entry DOI: 10.7270/Q2C53M9C
Collagenase 3
(Homo sapiens (Human))
BDBM50361620
(CHEMBL1939862)
Show SMILES CCOC(=O)c1cc2cc(ccc2[nH]1)C(N)=O
Show InChI InChI=1S/C12H12N2O3/c1-2-17-12(16)10-6-8-5-7(11(13)15)3-4-9(8)14-10/h3-6,14H,2H2,1H3,(H2,13,15)
NCI pathway
Reactome pathway
n/an/a 3.90E+4n/an/an/an/an/an/a
Boehringer Ingelheim Pharmaceuticals Inc
Curated by ChEMBL
Assay Description
Inhibition of human MMP13 expressed in Escherichia coli after 30 mins by fluorimetry
J Med Chem 54: 8174-87 (2011)
Article DOI: 10.1021/jm201129m
BindingDB Entry DOI: 10.7270/Q2C53M9C
3D
3D Structure (crystal)