null
SMILES: CCNC(=O)c1noc(c1NC(=O)c1cc2ccccc2n1C)-c1cc(C(C)C)c(O)cc1O
InChI Key: InChIKey=DSZDYWQJKXZWOZ-UHFFFAOYSA-N
Activity Spreadsheet -- Enzyme Inhibition Constant Data from BindingDB
Found 1 hit for monomerid = 50361723
Trg + Lig
Ki
nM
ΔG°
kcal/mole
IC50
nM
Kd
nM
EC50/IC50
nM
koff
s-1
kon
M-1s-1
pHTemp
°C
Heat shock protein HSP 90-beta
(Homo sapiens (Human))
BDBM50361723
(CHEMBL1941072)
Show SMILES CCNC(=O)c1noc(c1NC(=O)c1cc2ccccc2n1C)-c1cc(C(C)C)c(O)cc1O
Show InChI InChI=1S/C25H26N4O5/c1-5-26-25(33)22-21(27-24(32)18-10-14-8-6-7-9-17(14)29(18)4)23(34-28-22)16-11-15(13(2)3)19(30)12-20(16)31/h6-13,30-31H,5H2,1-4H3,(H,26,33)(H,27,32)
Reactome pathway
n/an/a 62n/an/an/an/an/an/a
Universit£ degli Studi di Ferrara
Curated by ChEMBL
Assay Description
Binding affinity to Hsp90 after 4 hrs by fluorescence polarization assay
J Med Chem 54: 8592-604 (2011)
Article DOI: 10.1021/jm201155e
BindingDB Entry DOI: 10.7270/Q2QF8T9M