BDBM50361733 CHEMBL1940943
SMILES: CCNC(=O)c1noc(c1NC(=O)C1CC(O)C1)-c1cc(C(C)C)c(O)cc1O
InChI Key: InChIKey=ICDPIRXSKRGAJV-UHFFFAOYSA-N
Data: 1 IC50
Activity Spreadsheet -- Enzyme Inhibition Constant Data from BindingDB
Found 1 hit for monomerid = 50361733
Trg + Lig
Ki
nM
ΔG°
kcal/mole
IC50
nM
Kd
nM
EC50/IC50
nM
koff
s-1
kon
M-1s-1
pHTemp
°C
Heat shock protein HSP 90-beta
(Homo sapiens (Human))
BDBM50361733
(CHEMBL1940943)
Show SMILES CCNC(=O)c1noc(c1NC(=O)C1CC(O)C1)-c1cc(C(C)C)c(O)cc1O |(4.32,.4,;2.78,.4,;2.02,1.74,;.48,1.75,;-.19,3.13,;-.39,.47,;.12,-.98,;-1.1,-1.92,;-2.37,-1.04,;-1.93,.43,;-2.87,1.65,;-4.41,1.69,;-5.21,.37,;-5.15,3.04,;-4.72,4.52,;-6.2,4.95,;-6.94,6.3,;-6.63,3.47,;-3.7,-1.81,;-5.04,-1.05,;-6.36,-1.82,;-7.7,-1.05,;-7.7,.49,;-9.03,-1.82,;-6.37,-3.36,;-7.7,-4.13,;-5.03,-4.14,;-3.7,-3.36,;-2.36,-4.13,)|
Show InChI InChI=1S/C20H25N3O6/c1-4-21-20(28)17-16(22-19(27)10-5-11(24)6-10)18(29-23-17)13-7-12(9(2)3)14(25)8-15(13)26/h7-11,24-26H,4-6H2,1-3H3,(H,21,28)(H,22,27)
Reactome pathway
n/an/a 14n/an/an/an/an/an/a
Universit£ degli Studi di Ferrara
Curated by ChEMBL
Assay Description
Binding affinity to Hsp90 after 4 hrs by fluorescence polarization assay
J Med Chem 54: 8592-604 (2011)
Article DOI: 10.1021/jm201155e
BindingDB Entry DOI: 10.7270/Q2QF8T9M