BDBM50364928 CHEMBL1950343
SMILES: CC1CCN(CC1)C(=O)c1ccc2n(C)c3CCN(Cc3c2c1)C1CCCC1
InChI Key: InChIKey=AMHQJYVBDKPZSA-UHFFFAOYSA-N
Data: 1 KI  1 EC50
Activity Spreadsheet -- Enzyme Inhibition Constant Data from BindingDB
Found 2 hits for monomerid = 50364928
Trg + Lig
Ki
nM
ΔG°
kcal/mole
IC50
nM
Kd
nM
EC50/IC50
nM
koff
s-1
kon
M-1s-1
pHTemp
°C
Cannabinoid receptor 1
(Homo sapiens (Human))
BDBM50364928
(CHEMBL1950343)
Show SMILES CC1CCN(CC1)C(=O)c1ccc2n(C)c3CCN(Cc3c2c1)C1CCCC1
Show InChI InChI=1S/C24H33N3O/c1-17-9-12-26(13-10-17)24(28)18-7-8-22-20(15-18)21-16-27(19-5-3-4-6-19)14-11-23(21)25(22)2/h7-8,15,17,19H,3-6,9-14,16H2,1-2H3
NCI pathway
Reactome pathway
32n/an/an/an/an/an/an/an/a
AstraZeneca R&D Montreal
Curated by ChEMBL
Assay Description
Displacement of [3H]-CP55,940 from human CB1 receptor expressed in HEK293 cells
Bioorg Med Chem Lett 22: 1619-24 (2012)
Article DOI: 10.1016/j.bmcl.2011.12.124
BindingDB Entry DOI: 10.7270/Q24J0FJX
Cannabinoid receptor 1
(Homo sapiens (Human))
BDBM50364928
(CHEMBL1950343)
Show SMILES CC1CCN(CC1)C(=O)c1ccc2n(C)c3CCN(Cc3c2c1)C1CCCC1
Show InChI InChI=1S/C24H33N3O/c1-17-9-12-26(13-10-17)24(28)18-7-8-22-20(15-18)21-16-27(19-5-3-4-6-19)14-11-23(21)25(22)2/h7-8,15,17,19H,3-6,9-14,16H2,1-2H3
NCI pathway
Reactome pathway
n/an/an/an/a 77n/an/an/an/a
AstraZeneca R&D Montreal
Curated by ChEMBL
Assay Description
Agonist activity at human CB1 receptor expressed in HEK293 EBNA cells by [35S]GTPgamma binding assay
Bioorg Med Chem Lett 22: 1619-24 (2012)
Article DOI: 10.1016/j.bmcl.2011.12.124
BindingDB Entry DOI: 10.7270/Q24J0FJX