BDBM50365231 CHEMBL1738786::US9238653, Table 5, Compound 7
SMILES: Cc1cc(Nc2ccc(cc2)C(F)(F)F)n2nc(nc2n1)C(C)(F)F
InChI Key: InChIKey=CUCVTDOXQYMYKL-UHFFFAOYSA-N
Data: 8 IC50
PDB links: 1 PDB ID matches this monomer.
Activity Spreadsheet -- Enzyme Inhibition Constant Data from BindingDB
Found 8 hits for monomerid = 50365231
Trg + Lig
Ki
nM
ΔG°
kcal/mole
IC50
nM
Kd
nM
EC50/IC50
nM
koff
s-1
kon
M-1s-1
pHTemp
°C
Dihydroorotate dehydrogenase (quinone), mitochondrial
(Plasmodium falciparum (isolate 3D7))
BDBM50365231
(CHEMBL1738786 | US9238653, Table 5, Compound 7)
Show SMILES Cc1cc(Nc2ccc(cc2)C(F)(F)F)n2nc(nc2n1)C(C)(F)F
Show InChI InChI=1S/C15H12F5N5/c1-8-7-11(22-10-5-3-9(4-6-10)15(18,19)20)25-13(21-8)23-12(24-25)14(2,16)17/h3-7,22H,1-2H3
US Patent
n/an/a 38n/an/an/an/a8.0n/a
BOARD OF REGENTS, THE UNIVERSITY OF TEXAS SYSTEM; MMV MEDICINES FOR MALARIA VENTURE; UNIVERSITY OF WASHINGTON
US Patent
Assay Description
For studying inhibition of Plasmodium or human DHODH enzyme, two assays that are in routine use are described, for example, in Baldwin, et al. (2002)...
US Patent US9238653 (2016)
BindingDB Entry DOI: 10.7270/Q2D79954
3D
3D Structure (crystal)
Dihydroorotate Dehydrogenase (DHODH)
(Rattus norvegicus (rat))
BDBM50365231
(CHEMBL1738786 | US9238653, Table 5, Compound 7)
Show SMILES Cc1cc(Nc2ccc(cc2)C(F)(F)F)n2nc(nc2n1)C(C)(F)F
Show InChI InChI=1S/C15H12F5N5/c1-8-7-11(22-10-5-3-9(4-6-10)15(18,19)20)25-13(21-8)23-12(24-25)14(2,16)17/h3-7,22H,1-2H3
Reactome pathway
n/an/a 7.20E+3n/an/an/an/an/an/a
University of Texas Southwestern Medical Center at Dallas
Curated by ChEMBL
Assay Description
Inhibition of rat DHODH (amino acid residues 30 to 396) expressed in Escherichia coli BL21 cells assessed as orotic acid production using dihydroorot...
J Med Chem 57: 5381-94 (2014)
Article DOI: 10.1021/jm500481t
BindingDB Entry DOI: 10.7270/Q2WM1FZ6
Dihydroorotate dehydrogenase
(Mus musculus)
BDBM50365231
(CHEMBL1738786 | US9238653, Table 5, Compound 7)
Show SMILES Cc1cc(Nc2ccc(cc2)C(F)(F)F)n2nc(nc2n1)C(C)(F)F
Show InChI InChI=1S/C15H12F5N5/c1-8-7-11(22-10-5-3-9(4-6-10)15(18,19)20)25-13(21-8)23-12(24-25)14(2,16)17/h3-7,22H,1-2H3
Reactome pathway
n/an/a 2.40E+4n/an/an/an/an/an/a
University of Texas Southwestern Medical Center at Dallas
Curated by ChEMBL
Assay Description
Inhibition of mouse DHODH (amino acid residues 30 to 396) expressed in Escherichia coli BL21 cells assessed as orotic acid production using dihydroor...
J Med Chem 57: 5381-94 (2014)
Article DOI: 10.1021/jm500481t
BindingDB Entry DOI: 10.7270/Q2WM1FZ6
Dihydroorotate dehydrogenase (quinone), mitochondrial
(Schistosoma mansoni)
BDBM50365231
(CHEMBL1738786 | US9238653, Table 5, Compound 7)
Show SMILES Cc1cc(Nc2ccc(cc2)C(F)(F)F)n2nc(nc2n1)C(C)(F)F
Show InChI InChI=1S/C15H12F5N5/c1-8-7-11(22-10-5-3-9(4-6-10)15(18,19)20)25-13(21-8)23-12(24-25)14(2,16)17/h3-7,22H,1-2H3
n/an/a 2.10E+4n/an/an/an/an/an/a
University of Turin (UniTo)
Curated by ChEMBL
Assay Description
Inhibition of Schistosoma mansoni DHODH
Eur J Med Chem 183: (2019)
Article DOI: 10.1016/j.ejmech.2019.111681
Dihydroorotate dehydrogenase
(Homo sapiens (Human))
BDBM50365231
(CHEMBL1738786 | US9238653, Table 5, Compound 7)
Show SMILES Cc1cc(Nc2ccc(cc2)C(F)(F)F)n2nc(nc2n1)C(C)(F)F
Show InChI InChI=1S/C15H12F5N5/c1-8-7-11(22-10-5-3-9(4-6-10)15(18,19)20)25-13(21-8)23-12(24-25)14(2,16)17/h3-7,22H,1-2H3
Reactome pathway
n/an/a>1.00E+5n/an/an/an/an/an/a
University of Texas Southwestern Medical Center at Dallas
Curated by ChEMBL
Assay Description
Inhibition of C-terminal His6-tagged human DHODH (amino acid residues 30 to 396) expressed in Escherichia coli BL21 cells assessed as orotic acid pro...
J Med Chem 57: 5381-94 (2014)
Article DOI: 10.1021/jm500481t
BindingDB Entry DOI: 10.7270/Q2WM1FZ6
Dihydroorotate dehydrogenase
(Homo sapiens (Human))
BDBM50365231
(CHEMBL1738786 | US9238653, Table 5, Compound 7)
Show SMILES Cc1cc(Nc2ccc(cc2)C(F)(F)F)n2nc(nc2n1)C(C)(F)F
Show InChI InChI=1S/C15H12F5N5/c1-8-7-11(22-10-5-3-9(4-6-10)15(18,19)20)25-13(21-8)23-12(24-25)14(2,16)17/h3-7,22H,1-2H3
Reactome pathway
n/an/a>1.00E+5n/an/an/an/an/an/a
GlaxoSmithKline
Curated by ChEMBL
Assay Description
Inhibition of human C-terminal hexa-His tagged DHODH expressed in Escherichia coli by DCIP reduction assay
J Med Chem 54: 5540-61 (2011)
Article DOI: 10.1021/jm200592f
BindingDB Entry DOI: 10.7270/Q21N81M0
Dihydroorotate dehydrogenase
(Homo sapiens (Human))
BDBM50365231
(CHEMBL1738786 | US9238653, Table 5, Compound 7)
Show SMILES Cc1cc(Nc2ccc(cc2)C(F)(F)F)n2nc(nc2n1)C(C)(F)F
Show InChI InChI=1S/C15H12F5N5/c1-8-7-11(22-10-5-3-9(4-6-10)15(18,19)20)25-13(21-8)23-12(24-25)14(2,16)17/h3-7,22H,1-2H3
Reactome pathway
n/an/a 7.00E+3n/an/an/an/an/an/a
University of Turin (UniTo)
Curated by ChEMBL
Assay Description
Inhibition of human DHODH
Eur J Med Chem 183: (2019)
Article DOI: 10.1016/j.ejmech.2019.111681
Dihydroorotate dehydrogenase
(Homo sapiens (Human))
BDBM50365231
(CHEMBL1738786 | US9238653, Table 5, Compound 7)
Show SMILES Cc1cc(Nc2ccc(cc2)C(F)(F)F)n2nc(nc2n1)C(C)(F)F
Show InChI InChI=1S/C15H12F5N5/c1-8-7-11(22-10-5-3-9(4-6-10)15(18,19)20)25-13(21-8)23-12(24-25)14(2,16)17/h3-7,22H,1-2H3
Reactome pathway
n/an/a>1.00E+5n/an/an/an/an/an/a
University of Texas Southwestern Medical Center at Dallas
Curated by ChEMBL
Assay Description
Inhibition of C-terminal His6-tagged human DHODH (amino acid residues 30 to 396) expressed in Escherichia coli BL21 cells assessed as orotic acid pro...
J Med Chem 57: 5381-94 (2014)
Article DOI: 10.1021/jm500481t
BindingDB Entry DOI: 10.7270/Q2WM1FZ6