BDBM50365991 CHEMBL1956430
SMILES: O=C(Nc1sc2CCCCc2c1C#N)C1CC1
InChI Key: InChIKey=DAYQQRFQUSNVLD-UHFFFAOYSA-N
Data: 1 IC50
Activity Spreadsheet -- Enzyme Inhibition Constant Data from BindingDB
Found 1 hit for monomerid = 50365991
Trg + Lig
Ki
nM
ΔG°
kcal/mole
IC50
nM
Kd
nM
EC50/IC50
nM
koff
s-1
kon
M-1s-1
pHTemp
°C
Vasoactive intestinal polypeptide receptor 1
(Rattus norvegicus)
BDBM50365991
(CHEMBL1956430)
Show SMILES O=C(Nc1sc2CCCCc2c1C#N)C1CC1
Show InChI InChI=1S/C13H14N2OS/c14-7-10-9-3-1-2-4-11(9)17-13(10)15-12(16)8-5-6-8/h8H,1-6H2,(H,15,16)
n/an/a 2.70E+3n/an/an/an/an/an/a
Bristol-Myers Squibb Co.
Curated by ChEMBL
Assay Description
Antagonist activity at vasoactive intestinal peptide receptor 1 in rat RKE cells assessed as inhibition of VIP-induced intracellular cAMP accumulatio...
Bioorg Med Chem Lett 22: 2287-90 (2012)
Article DOI: 10.1016/j.bmcl.2012.01.082
BindingDB Entry DOI: 10.7270/Q2Q240QR