BDBM50366043 CHEMBL1956740::US8927730, 3c
SMILES: Cc1cc(N)nc(C[C@H]2CNC[C@H]2OCCNCc2ccccc2O)c1
InChI Key: InChIKey=YLQFJYDIDCSGLP-QFBILLFUSA-N
Data: 6 KI  3 IC50
PDB links: 1 PDB ID matches this monomer.
Activity Spreadsheet -- Enzyme Inhibition Constant Data from BindingDB
Found 8 hits for monomerid = 50366043
Trg + Lig
Ki
nM
ΔG°
kcal/mole
IC50
nM
Kd
nM
EC50/IC50
nM
koff
s-1
kon
M-1s-1
pHTemp
°C
Nitric oxide synthase, brain
(Rattus norvegicus (rat))
BDBM50366043
(CHEMBL1956740 | US8927730, 3c)
Show SMILES Cc1cc(N)nc(C[C@H]2CNC[C@H]2OCCNCc2ccccc2O)c1 |r|
Show InChI InChI=1S/C20H28N4O2/c1-14-8-17(24-20(21)9-14)10-16-12-23-13-19(16)26-7-6-22-11-15-4-2-3-5-18(15)25/h2-5,8-9,16,19,22-23,25H,6-7,10-13H2,1H3,(H2,21,24)/t16-,19+/m0/s1
US Patent
390 -9.09 3.50E+3n/an/an/an/a7.437
Northwestern University
US Patent
Assay Description
The three NOS isoforms, rat nNOS, murine iNOS and bovine eNOS were recombinant enzymes overexpressed in E. coli and purified as reported in the liter...
US Patent US8927730 (2015)
BindingDB Entry DOI: 10.7270/Q2610Z1V
3D
3D Structure (crystal)
Nitric oxide synthase, brain
(Rattus norvegicus (rat))
BDBM50366043
(CHEMBL1956740 | US8927730, 3c)
Show SMILES Cc1cc(N)nc(C[C@H]2CNC[C@H]2OCCNCc2ccccc2O)c1 |r|
Show InChI InChI=1S/C20H28N4O2/c1-14-8-17(24-20(21)9-14)10-16-12-23-13-19(16)26-7-6-22-11-15-4-2-3-5-18(15)25/h2-5,8-9,16,19,22-23,25H,6-7,10-13H2,1H3,(H2,21,24)/t16-,19+/m0/s1
390n/an/an/an/an/an/an/an/a
Northwestern University
Curated by ChEMBL
Assay Description
Inhibition of recombinant rat nNOS expressed in Escherichia coli by hemoglobin capture assay
Bioorg Med Chem 20: 2435-43 (2012)
Article DOI: 10.1016/j.bmc.2012.01.037
BindingDB Entry DOI: 10.7270/Q26110TZ
3D
3D Structure (crystal)
Nitric oxide synthase, endothelial
(Bos taurus (bovine))
BDBM50366043
(CHEMBL1956740 | US8927730, 3c)
Show SMILES Cc1cc(N)nc(C[C@H]2CNC[C@H]2OCCNCc2ccccc2O)c1 |r|
Show InChI InChI=1S/C20H28N4O2/c1-14-8-17(24-20(21)9-14)10-16-12-23-13-19(16)26-7-6-22-11-15-4-2-3-5-18(15)25/h2-5,8-9,16,19,22-23,25H,6-7,10-13H2,1H3,(H2,21,24)/t16-,19+/m0/s1
3.70E+4n/an/an/an/an/an/an/an/a
Northwestern University
Curated by ChEMBL
Assay Description
Inhibition of recombinant bovine eNOS expressed in Escherichia coli by hemoglobin capture assay
Bioorg Med Chem 20: 2435-43 (2012)
Article DOI: 10.1016/j.bmc.2012.01.037
BindingDB Entry DOI: 10.7270/Q26110TZ
Nitric oxide synthase, endothelial
(Bos taurus (bovine))
BDBM50366043
(CHEMBL1956740 | US8927730, 3c)
Show SMILES Cc1cc(N)nc(C[C@H]2CNC[C@H]2OCCNCc2ccccc2O)c1 |r|
Show InChI InChI=1S/C20H28N4O2/c1-14-8-17(24-20(21)9-14)10-16-12-23-13-19(16)26-7-6-22-11-15-4-2-3-5-18(15)25/h2-5,8-9,16,19,22-23,25H,6-7,10-13H2,1H3,(H2,21,24)/t16-,19+/m0/s1
US Patent
3.70E+4 -6.28n/an/an/an/an/a7.437
Northwestern University
US Patent
Assay Description
The three NOS isoforms, rat nNOS, murine iNOS and bovine eNOS were recombinant enzymes overexpressed in E. coli and purified as reported in the liter...
US Patent US8927730 (2015)
BindingDB Entry DOI: 10.7270/Q2610Z1V
Nitric oxide synthase, inducible
(Mus musculus (mouse))
BDBM50366043
(CHEMBL1956740 | US8927730, 3c)
Show SMILES Cc1cc(N)nc(C[C@H]2CNC[C@H]2OCCNCc2ccccc2O)c1 |r|
Show InChI InChI=1S/C20H28N4O2/c1-14-8-17(24-20(21)9-14)10-16-12-23-13-19(16)26-7-6-22-11-15-4-2-3-5-18(15)25/h2-5,8-9,16,19,22-23,25H,6-7,10-13H2,1H3,(H2,21,24)/t16-,19+/m0/s1
Reactome pathway
US Patent
5.70E+4 -6.02n/an/an/an/an/a7.437
Northwestern University
US Patent
Assay Description
The three NOS isoforms, rat nNOS, murine iNOS and bovine eNOS were recombinant enzymes overexpressed in E. coli and purified as reported in the liter...
US Patent US8927730 (2015)
BindingDB Entry DOI: 10.7270/Q2610Z1V
Nitric oxide synthase, inducible
(Mus musculus (mouse))
BDBM50366043
(CHEMBL1956740 | US8927730, 3c)
Show SMILES Cc1cc(N)nc(C[C@H]2CNC[C@H]2OCCNCc2ccccc2O)c1 |r|
Show InChI InChI=1S/C20H28N4O2/c1-14-8-17(24-20(21)9-14)10-16-12-23-13-19(16)26-7-6-22-11-15-4-2-3-5-18(15)25/h2-5,8-9,16,19,22-23,25H,6-7,10-13H2,1H3,(H2,21,24)/t16-,19+/m0/s1
Reactome pathway
5.70E+4n/an/an/an/an/an/an/an/a
Northwestern University
Curated by ChEMBL
Assay Description
Inhibition of recombinant mouse iNOS expressed in Escherichia coli by hemoglobin capture assay
Bioorg Med Chem 20: 2435-43 (2012)
Article DOI: 10.1016/j.bmc.2012.01.037
BindingDB Entry DOI: 10.7270/Q26110TZ
Nitric oxide synthase, brain
(Rattus norvegicus (rat))
BDBM50366043
(CHEMBL1956740 | US8927730, 3c)
Show SMILES Cc1cc(N)nc(C[C@H]2CNC[C@H]2OCCNCc2ccccc2O)c1 |r|
Show InChI InChI=1S/C20H28N4O2/c1-14-8-17(24-20(21)9-14)10-16-12-23-13-19(16)26-7-6-22-11-15-4-2-3-5-18(15)25/h2-5,8-9,16,19,22-23,25H,6-7,10-13H2,1H3,(H2,21,24)/t16-,19+/m0/s1
n/an/a 4.30E+4n/an/an/an/an/an/a
Northwestern University
Curated by ChEMBL
Assay Description
Inhibition of rat nNOS expressed in HEK293T cells preincubated for 30 mins prior A23187-induced activation measured after 6 hrs by Griess assay
Bioorg Med Chem 20: 2435-43 (2012)
Article DOI: 10.1016/j.bmc.2012.01.037
BindingDB Entry DOI: 10.7270/Q26110TZ
3D
3D Structure (crystal)
Nitric oxide synthase, brain
(Rattus norvegicus (rat))
BDBM50366043
(CHEMBL1956740 | US8927730, 3c)
Show SMILES Cc1cc(N)nc(C[C@H]2CNC[C@H]2OCCNCc2ccccc2O)c1 |r|
Show InChI InChI=1S/C20H28N4O2/c1-14-8-17(24-20(21)9-14)10-16-12-23-13-19(16)26-7-6-22-11-15-4-2-3-5-18(15)25/h2-5,8-9,16,19,22-23,25H,6-7,10-13H2,1H3,(H2,21,24)/t16-,19+/m0/s1
n/an/a 3.50E+3n/an/an/an/an/an/a
Northwestern University
Curated by ChEMBL
Assay Description
Inhibition of recombinant rat nNOS expressed in Escherichia coli by hemoglobin capture assay
Bioorg Med Chem 20: 2435-43 (2012)
Article DOI: 10.1016/j.bmc.2012.01.037
BindingDB Entry DOI: 10.7270/Q26110TZ
3D
3D Structure (crystal)