BDBM50369409 CHEMBL1791004
SMILES: CC[C@@H](C)[C@H](NS(=O)(=O)c1ccc2ccccc2c1)C(=O)N[C@H](Cc1c[nH]c2ccccc12)C=O
InChI Key: InChIKey=FQFPEBKHQBECAZ-WTSFKKHRSA-N
Data: 2 IC50
Activity Spreadsheet -- Enzyme Inhibition Constant Data from BindingDB
Found 2 hits for monomerid = 50369409
Trg + Lig
Ki
nM
ΔG°
kcal/mole
IC50
nM
Kd
nM
EC50/IC50
nM
koff
s-1
kon
M-1s-1
pHTemp
°C
Procathepsin L
(Homo sapiens (Human))
BDBM50369409
(CHEMBL1791004)
Show SMILES CC[C@@H](C)[C@H](NS(=O)(=O)c1ccc2ccccc2c1)C(=O)N[C@H](Cc1c[nH]c2ccccc12)C=O
Show InChI InChI=1S/C27H29N3O4S/c1-3-18(2)26(30-35(33,34)23-13-12-19-8-4-5-9-20(19)15-23)27(32)29-22(17-31)14-21-16-28-25-11-7-6-10-24(21)25/h4-13,15-18,22,26,28,30H,3,14H2,1-2H3,(H,29,32)/t18-,22-,26+/m1/s1
Reactome pathway
n/an/a 3.90n/an/an/an/an/an/a
Takeda Chemical Industries, Ltd.
Curated by ChEMBL
Assay Description
Inhibition of human cathepsin L.
J Med Chem 41: 4301-8 (1998)
Article DOI: 10.1021/jm9803065
BindingDB Entry DOI: 10.7270/Q2VQ33CX
Cathepsin B
(Homo sapiens (Human))
BDBM50369409
(CHEMBL1791004)
Show SMILES CC[C@@H](C)[C@H](NS(=O)(=O)c1ccc2ccccc2c1)C(=O)N[C@H](Cc1c[nH]c2ccccc12)C=O
Show InChI InChI=1S/C27H29N3O4S/c1-3-18(2)26(30-35(33,34)23-13-12-19-8-4-5-9-20(19)15-23)27(32)29-22(17-31)14-21-16-28-25-11-7-6-10-24(21)25/h4-13,15-18,22,26,28,30H,3,14H2,1-2H3,(H,29,32)/t18-,22-,26+/m1/s1
Reactome pathway
n/an/a 23n/an/an/an/an/an/a
Takeda Chemical Industries, Ltd.
Curated by ChEMBL
Assay Description
Inhibition of human cathepsin B
J Med Chem 41: 4301-8 (1998)
Article DOI: 10.1021/jm9803065
BindingDB Entry DOI: 10.7270/Q2VQ33CX