BDBM50369950 CHEMBL609769
SMILES: CCCCCCCCCNC(=O)[C@H]1OC([C@H](O)[C@@H]1O)n1cnc2c(N)ncnc12
InChI Key: InChIKey=VAZUKUKQSVLTGE-FRLFKWGPSA-N
Data: 1 KI
Activity Spreadsheet -- Enzyme Inhibition Constant Data from BindingDB
Found 1 hit for monomerid = 50369950
Trg + Lig
Ki
nM
ΔG°
kcal/mole
IC50
nM
Kd
nM
EC50/IC50
nM
koff
s-1
kon
M-1s-1
pHTemp
°C
G protein-coupled receptor 80
(Rattus norvegicus)
BDBM50369950
(CHEMBL609769)
Show SMILES CCCCCCCCCNC(=O)[C@H]1OC([C@H](O)[C@@H]1O)n1cnc2c(N)ncnc12 |r|
Show InChI InChI=1S/C19H30N6O4/c1-2-3-4-5-6-7-8-9-21-18(28)15-13(26)14(27)19(29-15)25-11-24-12-16(20)22-10-23-17(12)25/h10-11,13-15,19,26-27H,2-9H2,1H3,(H,21,28)(H2,20,22,23)/t13-,14+,15-,19?/m0/s1
Reactome pathway
31n/an/an/an/an/an/an/an/a
Hokkaido University
Curated by ChEMBL
Assay Description
Binding activity of P3 purinoceptor-like protein (P3LP) using radioligand 40 nM [3H]NECA from rat brain membranes
J Med Chem 44: 208-14 (2001)
BindingDB Entry DOI: 10.7270/Q2H41S5S