BDBM50372195 CHEMBL257907
SMILES: CCCN(CCC)C(=O)c1cc(C)cc(c1)C(=O)N[C@@H](Cc1cc(F)cc(F)c1)[C@H](O)[C@H]1C[C@@H](Cc2cccc(OC)c2)CCN1
InChI Key: InChIKey=ZFNBTDVLFDGNJZ-NUUAREAFSA-N
Data: 1 IC50
Activity Spreadsheet -- Enzyme Inhibition Constant Data from BindingDB
Found 1 hit for monomerid = 50372195
Trg + Lig
Ki
nM
ΔG°
kcal/mole
IC50
nM
Kd
nM
EC50/IC50
nM
koff
s-1
kon
M-1s-1
pHTemp
°C
Beta-secretase 1
(Homo sapiens (Human))
BDBM50372195
(CHEMBL257907)
Show SMILES CCCN(CCC)C(=O)c1cc(C)cc(c1)C(=O)N[C@@H](Cc1cc(F)cc(F)c1)[C@H](O)[C@H]1C[C@@H](Cc2cccc(OC)c2)CCN1
Show InChI InChI=1S/C37H47F2N3O4/c1-5-12-42(13-6-2)37(45)29-15-24(3)14-28(22-29)36(44)41-34(21-27-17-30(38)23-31(39)18-27)35(43)33-20-26(10-11-40-33)16-25-8-7-9-32(19-25)46-4/h7-9,14-15,17-19,22-23,26,33-35,40,43H,5-6,10-13,16,20-21H2,1-4H3,(H,41,44)/t26-,33-,34+,35-/m1/s1
n/an/a 330n/an/an/an/an/an/a
Schering-Plough Research Institute
Curated by ChEMBL
Assay Description
Inhibition of human BACE1
Bioorg Med Chem Lett 18: 414-7 (2008)
Article DOI: 10.1016/j.bmcl.2007.10.116
BindingDB Entry DOI: 10.7270/Q2RV0PJH