BDBM50372997 CHEMBL256493
SMILES: COc1cnn(C)c(=O)c1-c1ccc(C[C@H](NC(=O)c2cccnc2Cl)C(O)=O)cc1
InChI Key: InChIKey=PWLBENPPAZYTLF-HNNXBMFYSA-N
Data: 2 IC50
Activity Spreadsheet -- Enzyme Inhibition Constant Data from BindingDB
Found 2 hits for monomerid = 50372997
Trg + Lig
Ki
nM
ΔG°
kcal/mole
IC50
nM
Kd
nM
EC50/IC50
nM
koff
s-1
kon
M-1s-1
pHTemp
°C
Integrin alpha-4/beta-1
(Homo sapiens (Human))
BDBM50372997
(CHEMBL256493)
Show SMILES COc1cnn(C)c(=O)c1-c1ccc(C[C@H](NC(=O)c2cccnc2Cl)C(O)=O)cc1
Show InChI InChI=1S/C21H19ClN4O5/c1-26-20(28)17(16(31-2)11-24-26)13-7-5-12(6-8-13)10-15(21(29)30)25-19(27)14-4-3-9-23-18(14)22/h3-9,11,15H,10H2,1-2H3,(H,25,27)(H,29,30)/t15-/m0/s1
Reactome pathway
n/an/a 730n/an/an/an/an/an/a
Johnson& Johnson Pharmaceutical Research& Development
Curated by ChEMBL
Assay Description
Inhibition of human integrin alpha-4-beta-1-mediated Ramos cell adhesion to immobilized VCAM1
Bioorg Med Chem Lett 18: 1331-5 (2008)
Article DOI: 10.1016/j.bmcl.2008.01.022
BindingDB Entry DOI: 10.7270/Q2TD9Z6W
Integrin alpha-4/beta-7
(Homo sapiens (Human))
BDBM50372997
(CHEMBL256493)
Show SMILES COc1cnn(C)c(=O)c1-c1ccc(C[C@H](NC(=O)c2cccnc2Cl)C(O)=O)cc1
Show InChI InChI=1S/C21H19ClN4O5/c1-26-20(28)17(16(31-2)11-24-26)13-7-5-12(6-8-13)10-15(21(29)30)25-19(27)14-4-3-9-23-18(14)22/h3-9,11,15H,10H2,1-2H3,(H,25,27)(H,29,30)/t15-/m0/s1
n/an/a 35n/an/an/an/an/an/a
Johnson& Johnson Pharmaceutical Research& Development
Curated by ChEMBL
Assay Description
Inhibition of human integrin alpha-4-beta-7-mediated K562 cell adhesion to immobilized MAdCAM1
Bioorg Med Chem Lett 18: 1331-5 (2008)
Article DOI: 10.1016/j.bmcl.2008.01.022
BindingDB Entry DOI: 10.7270/Q2TD9Z6W