BDBM50374637 CHEMBL271077
SMILES: COC(=O)[C@@H]1C[C@H](OCOCCF)C(=O)[C@H]2[C@@]1(C)CC[C@H]1C(=O)O[C@@H](C[C@]21C)c1ccoc1
InChI Key: InChIKey=BESVDGAGHUYOPY-WFOQEEKOSA-N
Data: 3 KI  1 EC50
Activity Spreadsheet -- Enzyme Inhibition Constant Data from BindingDB
Found 4 hits for monomerid = 50374637
Trg + Lig
Ki
nM
ΔG°
kcal/mole
IC50
nM
Kd
nM
EC50/IC50
nM
koff
s-1
kon
M-1s-1
pHTemp
°C
Kappa-type opioid receptor
(Homo sapiens (Human))
BDBM50374637
(CHEMBL271077)
Show SMILES COC(=O)[C@@H]1C[C@H](OCOCCF)C(=O)[C@H]2[C@@]1(C)CC[C@H]1C(=O)O[C@@H](C[C@]21C)c1ccoc1
Show InChI InChI=1S/C24H31FO8/c1-23-6-4-15-22(28)33-18(14-5-8-30-12-14)11-24(15,2)20(23)19(26)17(32-13-31-9-7-25)10-16(23)21(27)29-3/h5,8,12,15-18,20H,4,6-7,9-11,13H2,1-3H3/t15-,16-,17-,18-,20-,23-,24-/m0/s1
Reactome pathway
1.90n/an/an/an/an/an/an/an/a
McLean Hospital
Curated by ChEMBL
Assay Description
Displacement of [3H]diprenorphine from human kappa opioid receptor expressed in CHO cells
Bioorg Med Chem 16: 1279-86 (2008)
Article DOI: 10.1016/j.bmc.2007.10.067
BindingDB Entry DOI: 10.7270/Q2ZK5HJF
Delta-type opioid receptor
(MOUSE)
BDBM50374637
(CHEMBL271077)
Show SMILES COC(=O)[C@@H]1C[C@H](OCOCCF)C(=O)[C@H]2[C@@]1(C)CC[C@H]1C(=O)O[C@@H](C[C@]21C)c1ccoc1
Show InChI InChI=1S/C24H31FO8/c1-23-6-4-15-22(28)33-18(14-5-8-30-12-14)11-24(15,2)20(23)19(26)17(32-13-31-9-7-25)10-16(23)21(27)29-3/h5,8,12,15-18,20H,4,6-7,9-11,13H2,1-3H3/t15-,16-,17-,18-,20-,23-,24-/m0/s1
Reactome pathway
>1.00E+3n/an/an/an/an/an/an/an/a
McLean Hospital
Curated by ChEMBL
Assay Description
Displacement of [3H]diprenorphine from mouse delta opioid receptor expressed in CHO cells
Bioorg Med Chem 16: 1279-86 (2008)
Article DOI: 10.1016/j.bmc.2007.10.067
BindingDB Entry DOI: 10.7270/Q2ZK5HJF
Mu-type opioid receptor
(Rattus norvegicus (rat))
BDBM50374637
(CHEMBL271077)
Show SMILES COC(=O)[C@@H]1C[C@H](OCOCCF)C(=O)[C@H]2[C@@]1(C)CC[C@H]1C(=O)O[C@@H](C[C@]21C)c1ccoc1
Show InChI InChI=1S/C24H31FO8/c1-23-6-4-15-22(28)33-18(14-5-8-30-12-14)11-24(15,2)20(23)19(26)17(32-13-31-9-7-25)10-16(23)21(27)29-3/h5,8,12,15-18,20H,4,6-7,9-11,13H2,1-3H3/t15-,16-,17-,18-,20-,23-,24-/m0/s1
Reactome pathway
>1.00E+3n/an/an/an/an/an/an/an/a
McLean Hospital
Curated by ChEMBL
Assay Description
Displacement of [3H]diprenorphine from rat mu opioid receptor expressed in CHO cells
Bioorg Med Chem 16: 1279-86 (2008)
Article DOI: 10.1016/j.bmc.2007.10.067
BindingDB Entry DOI: 10.7270/Q2ZK5HJF
Kappa-type opioid receptor
(Homo sapiens (Human))
BDBM50374637
(CHEMBL271077)
Show SMILES COC(=O)[C@@H]1C[C@H](OCOCCF)C(=O)[C@H]2[C@@]1(C)CC[C@H]1C(=O)O[C@@H](C[C@]21C)c1ccoc1
Show InChI InChI=1S/C24H31FO8/c1-23-6-4-15-22(28)33-18(14-5-8-30-12-14)11-24(15,2)20(23)19(26)17(32-13-31-9-7-25)10-16(23)21(27)29-3/h5,8,12,15-18,20H,4,6-7,9-11,13H2,1-3H3/t15-,16-,17-,18-,20-,23-,24-/m0/s1
Reactome pathway
n/an/an/an/a 3.80n/an/an/an/a
McLean Hospital
Curated by ChEMBL
Assay Description
Agonist activity at human kappa opioid receptor expressed in CHO cells assessed as stimulation of [35S]GTPgammaS binding
Bioorg Med Chem 16: 1279-86 (2008)
Article DOI: 10.1016/j.bmc.2007.10.067
BindingDB Entry DOI: 10.7270/Q2ZK5HJF