BDBM50375140 CHEMBL256405
SMILES: CN(C)Cc1ccc(Nc2ncc3c(n2)n(cc(C(N)=O)c3=O)-c2ccc3CCCc3c2)cc1
InChI Key: InChIKey=WQGUJEFNLUBLCH-UHFFFAOYSA-N
Data: 1 IC50
Activity Spreadsheet -- Enzyme Inhibition Constant Data from BindingDB
Found 1 hit for monomerid = 50375140
Trg + Lig
Ki
nM
ΔG°
kcal/mole
IC50
nM
Kd
nM
EC50/IC50
nM
koff
s-1
kon
M-1s-1
pHTemp
°C
Macrophage colony stimulating factor receptor
(Homo sapiens (Human))
BDBM50375140
(CHEMBL256405)
Show SMILES CN(C)Cc1ccc(Nc2ncc3c(n2)n(cc(C(N)=O)c3=O)-c2ccc3CCCc3c2)cc1
Show InChI InChI=1S/C26H26N6O2/c1-31(2)14-16-6-9-19(10-7-16)29-26-28-13-21-23(33)22(24(27)34)15-32(25(21)30-26)20-11-8-17-4-3-5-18(17)12-20/h6-13,15H,3-5,14H2,1-2H3,(H2,27,34)(H,28,29,30)
n/an/a 21n/an/an/an/an/an/a
Johnson& Johnson Pharmaceutical Research& Development
Curated by ChEMBL
Assay Description
Inhibition of ATP-induced CSF1R autophosphorylation
Bioorg Med Chem Lett 18: 2355-61 (2008)
Article DOI: 10.1016/j.bmcl.2008.02.070
BindingDB Entry DOI: 10.7270/Q26W9BX3