BDBM50375341 CHEMBL261146
SMILES: Nc1nccn2c(nc(-c3ccc4ccc(nc4c3)-c3ccccc3)c12)[C@@H]1C[C@@H](C1)N1CCCC1
InChI Key: InChIKey=FIGFBANSNZERLU-ZRZAMGCNSA-N
Data: 2 IC50
Activity Spreadsheet -- Enzyme Inhibition Constant Data from BindingDB
Found 2 hits for monomerid = 50375341
Trg + Lig
Ki
nM
ΔG°
kcal/mole
IC50
nM
Kd
nM
EC50/IC50
nM
koff
s-1
kon
M-1s-1
pHTemp
°C
Cytochrome P450 3A4
(Homo sapiens (Human))
BDBM50375341
(CHEMBL261146)
Show SMILES Nc1nccn2c(nc(-c3ccc4ccc(nc4c3)-c3ccccc3)c12)[C@@H]1C[C@@H](C1)N1CCCC1 |wU:26.30,28.35,(6.76,3.51,;6.77,1.97,;5.45,1.2,;5.44,-.35,;6.78,-1.12,;8.11,-.35,;9.59,-.83,;10.5,.43,;9.59,1.69,;10.36,3.01,;9.6,4.34,;10.37,5.67,;11.92,5.67,;12.68,7,;14.23,6.99,;15.01,5.65,;14.23,4.32,;12.68,4.32,;11.91,3,;16.55,5.65,;17.32,4.31,;18.86,4.31,;19.63,5.64,;18.85,6.98,;17.31,6.98,;8.11,1.21,;10.07,-2.29,;9.37,-3.66,;10.75,-4.36,;11.44,-2.98,;11.22,-5.82,;10.33,-7.06,;11.23,-8.31,;12.7,-7.83,;12.7,-6.29,)|
Show InChI InChI=1S/C29H28N6/c30-28-27-26(21-9-8-20-10-11-24(32-25(20)18-21)19-6-2-1-3-7-19)33-29(35(27)15-12-31-28)22-16-23(17-22)34-13-4-5-14-34/h1-3,6-12,15,18,22-23H,4-5,13-14,16-17H2,(H2,30,31)/t22-,23+
Reactome pathway
n/an/a 1.70E+4n/an/an/an/an/an/a
OSI Pharmaceuticals, Inc.
Curated by ChEMBL
Assay Description
Inhibition of CYP3A4
Bioorg Med Chem 16: 1359-75 (2008)
Article DOI: 10.1016/j.bmc.2007.10.061
BindingDB Entry DOI: 10.7270/Q2WH2QVH
Insulin-like growth factor I receptor
(Homo sapiens (Human))
BDBM50375341
(CHEMBL261146)
Show SMILES Nc1nccn2c(nc(-c3ccc4ccc(nc4c3)-c3ccccc3)c12)[C@@H]1C[C@@H](C1)N1CCCC1 |wU:26.30,28.35,(6.76,3.51,;6.77,1.97,;5.45,1.2,;5.44,-.35,;6.78,-1.12,;8.11,-.35,;9.59,-.83,;10.5,.43,;9.59,1.69,;10.36,3.01,;9.6,4.34,;10.37,5.67,;11.92,5.67,;12.68,7,;14.23,6.99,;15.01,5.65,;14.23,4.32,;12.68,4.32,;11.91,3,;16.55,5.65,;17.32,4.31,;18.86,4.31,;19.63,5.64,;18.85,6.98,;17.31,6.98,;8.11,1.21,;10.07,-2.29,;9.37,-3.66,;10.75,-4.36,;11.44,-2.98,;11.22,-5.82,;10.33,-7.06,;11.23,-8.31,;12.7,-7.83,;12.7,-6.29,)|
Show InChI InChI=1S/C29H28N6/c30-28-27-26(21-9-8-20-10-11-24(32-25(20)18-21)19-6-2-1-3-7-19)33-29(35(27)15-12-31-28)22-16-23(17-22)34-13-4-5-14-34/h1-3,6-12,15,18,22-23H,4-5,13-14,16-17H2,(H2,30,31)/t22-,23+
Reactome pathway
n/an/a 77n/an/an/an/an/an/a
OSI Pharmaceuticals, Inc.
Curated by ChEMBL
Assay Description
Inhibition of human recombinant full length IGF1R expressed in mouse 3T3 cells
Bioorg Med Chem 16: 1359-75 (2008)
Article DOI: 10.1016/j.bmc.2007.10.061
BindingDB Entry DOI: 10.7270/Q2WH2QVH