BDBM50376808 CHEMBL408944
SMILES: CCc1cccc(CC)c1-c1cc(OC)c2C(CCCc2n1)N1CCc2ccc(OC)cc2C1
InChI Key: InChIKey=MPHSUWZCRDKHFZ-UHFFFAOYSA-N
Data: 1 IC50
Activity Spreadsheet -- Enzyme Inhibition Constant Data from BindingDB
Found 1 hit for monomerid = 50376808
Trg + Lig
Ki
nM
ΔG°
kcal/mole
IC50
nM
Kd
nM
EC50/IC50
nM
koff
s-1
kon
M-1s-1
pHTemp
°C
C5a anaphylatoxin chemotactic receptor (C5aR)
(Homo sapiens (Human))
BDBM50376808
(CHEMBL408944)
Show SMILES CCc1cccc(CC)c1-c1cc(OC)c2C(CCCc2n1)N1CCc2ccc(OC)cc2C1 |w:16.24|
Show InChI InChI=1S/C30H36N2O2/c1-5-20-9-7-10-21(6-2)29(20)26-18-28(34-4)30-25(31-26)11-8-12-27(30)32-16-15-22-13-14-24(33-3)17-23(22)19-32/h7,9-10,13-14,17-18,27H,5-6,8,11-12,15-16,19H2,1-4H3
n/an/a>1.00E+4n/an/an/an/an/an/a
Johnson& Johnson PRD
Curated by ChEMBL
Assay Description
Antagonist activity at human C5a receptor in U937 cells assessed as inhibition of anaphylatoxin-induced intracellular calcium mobilization
Bioorg Med Chem Lett 18: 2544-8 (2008)
Article DOI: 10.1016/j.bmcl.2008.03.049
BindingDB Entry DOI: 10.7270/Q2JM2BHD