BDBM50377767 CHEMBL429498
SMILES: Clc1ccc(CC(=O)Nc2cccc(c2)-c2[nH]c(nc2-c2ccnc(NCCN3CCNC3=O)n2)C2CC2)cc1
InChI Key: InChIKey=CBZHOVUXXVXVNO-UHFFFAOYSA-N
Data: 2 IC50
Activity Spreadsheet -- Enzyme Inhibition Constant Data from BindingDB
Found 2 hits for monomerid = 50377767
Trg + Lig
Ki
nM
ΔG°
kcal/mole
IC50
nM
Kd
nM
EC50/IC50
nM
koff
s-1
kon
M-1s-1
pHTemp
°C
Serine/threonine-protein kinase B-raf
(Homo sapiens (Human))
BDBM50377767
(CHEMBL429498)
Show SMILES Clc1ccc(CC(=O)Nc2cccc(c2)-c2[nH]c(nc2-c2ccnc(NCCN3CCNC3=O)n2)C2CC2)cc1
Show InChI InChI=1S/C29H29ClN8O2/c30-21-8-4-18(5-9-21)16-24(39)34-22-3-1-2-20(17-22)25-26(37-27(36-25)19-6-7-19)23-10-11-31-28(35-23)32-12-14-38-15-13-33-29(38)40/h1-5,8-11,17,19H,6-7,12-16H2,(H,33,40)(H,34,39)(H,36,37)(H,31,32,35)
NCI pathway
Reactome pathway
n/an/a 7n/an/an/an/an/an/a
Johnson& Johnson Pharmaceutical Research& Development
Curated by ChEMBL
Assay Description
Inhibition of B-RAF kinase
Bioorg Med Chem Lett 18: 2825-9 (2008)
Article DOI: 10.1016/j.bmcl.2008.04.002
BindingDB Entry DOI: 10.7270/Q2DJ5GH8
RAF proto-oncogene serine/threonine-protein kinase
(Homo sapiens (Human))
BDBM50377767
(CHEMBL429498)
Show SMILES Clc1ccc(CC(=O)Nc2cccc(c2)-c2[nH]c(nc2-c2ccnc(NCCN3CCNC3=O)n2)C2CC2)cc1
Show InChI InChI=1S/C29H29ClN8O2/c30-21-8-4-18(5-9-21)16-24(39)34-22-3-1-2-20(17-22)25-26(37-27(36-25)19-6-7-19)23-10-11-31-28(35-23)32-12-14-38-15-13-33-29(38)40/h1-5,8-11,17,19H,6-7,12-16H2,(H,33,40)(H,34,39)(H,36,37)(H,31,32,35)
NCI pathway
Reactome pathway
n/an/a 1n/an/an/an/an/an/a
Johnson& Johnson Pharmaceutical Research& Development
Curated by ChEMBL
Assay Description
Inhibition of C-RAF kinase
Bioorg Med Chem Lett 18: 2825-9 (2008)
Article DOI: 10.1016/j.bmcl.2008.04.002
BindingDB Entry DOI: 10.7270/Q2DJ5GH8