BDBM50378012 CHEMBL1627310
SMILES: OC(CCNC(=O)c1cc2cc(F)ccc2[nH]1)CN1CCN(CC1)c1cccc(Cl)c1Cl
InChI Key: InChIKey=DISKLDRQYHVOPT-UHFFFAOYSA-N
Data: 5 KI  1 IC50
Activity Spreadsheet -- Enzyme Inhibition Constant Data from BindingDB
Found 6 hits for monomerid = 50378012
Trg + Lig
Ki
nM
ΔG°
kcal/mole
IC50
nM
Kd
nM
EC50/IC50
nM
koff
s-1
kon
M-1s-1
pHTemp
°C
D(3) dopamine receptor
(Homo sapiens (Human))
BDBM50378012
(CHEMBL1627310)
Show SMILES OC(CCNC(=O)c1cc2cc(F)ccc2[nH]1)CN1CCN(CC1)c1cccc(Cl)c1Cl
Show InChI InChI=1S/C23H25Cl2FN4O2/c24-18-2-1-3-21(22(18)25)30-10-8-29(9-11-30)14-17(31)6-7-27-23(32)20-13-15-12-16(26)4-5-19(15)28-20/h1-5,12-13,17,28,31H,6-11,14H2,(H,27,32)
1.61n/an/an/an/an/an/an/an/a
National Institute on Drug AbuseIntramural Research Program
Curated by ChEMBL
Assay Description
Displacement of [125]IABN from human D3 receptor expressed in HEK293 cells
J Med Chem 52: 2559-70 (2009)
Article DOI: 10.1021/jm900095y
BindingDB Entry DOI: 10.7270/Q2HX1DKJ
D(3) dopamine receptor
(Homo sapiens (Human))
BDBM50378012
(CHEMBL1627310)
Show SMILES OC(CCNC(=O)c1cc2cc(F)ccc2[nH]1)CN1CCN(CC1)c1cccc(Cl)c1Cl
Show InChI InChI=1S/C23H25Cl2FN4O2/c24-18-2-1-3-21(22(18)25)30-10-8-29(9-11-30)14-17(31)6-7-27-23(32)20-13-15-12-16(26)4-5-19(15)28-20/h1-5,12-13,17,28,31H,6-11,14H2,(H,27,32)
1.80n/an/an/an/an/an/an/an/a
National Institute on Drug Abuse- Intramural Research Program
Curated by ChEMBL
Assay Description
Displacement of [3H]-N-methylspiperone from human dopamine D3 receptor (unknown origin) expressed in HEK293 cells after 1 hr by liquid scintillation ...
J Med Chem 58: 6195-213 (2015)
BindingDB Entry DOI: 10.7270/Q2KS6T92
D(2) dopamine receptor
(Homo sapiens (Human))
BDBM50378012
(CHEMBL1627310)
Show SMILES OC(CCNC(=O)c1cc2cc(F)ccc2[nH]1)CN1CCN(CC1)c1cccc(Cl)c1Cl
Show InChI InChI=1S/C23H25Cl2FN4O2/c24-18-2-1-3-21(22(18)25)30-10-8-29(9-11-30)14-17(31)6-7-27-23(32)20-13-15-12-16(26)4-5-19(15)28-20/h1-5,12-13,17,28,31H,6-11,14H2,(H,27,32)
Reactome pathway
328n/an/an/an/an/an/an/an/a
National Institute on Drug Abuse- Intramural Research Program
Curated by ChEMBL
Assay Description
Displacement of [3H]-N-methylspiperone from human dopamine D2 receptor (unknown origin) expressed in HEK293 cells after 1 hr by liquid scintillation ...
J Med Chem 58: 6195-213 (2015)
BindingDB Entry DOI: 10.7270/Q2KS6T92
D(4) dopamine receptor
(Homo sapiens (Human))
BDBM50378012
(CHEMBL1627310)
Show SMILES OC(CCNC(=O)c1cc2cc(F)ccc2[nH]1)CN1CCN(CC1)c1cccc(Cl)c1Cl
Show InChI InChI=1S/C23H25Cl2FN4O2/c24-18-2-1-3-21(22(18)25)30-10-8-29(9-11-30)14-17(31)6-7-27-23(32)20-13-15-12-16(26)4-5-19(15)28-20/h1-5,12-13,17,28,31H,6-11,14H2,(H,27,32)
Reactome pathway
>5.00E+3n/an/an/an/an/an/an/an/a
National Institute on Drug AbuseIntramural Research Program
Curated by ChEMBL
Assay Description
Displacement of [125]IABN from human D4 receptor expressed in HEK293 cells
J Med Chem 52: 2559-70 (2009)
Article DOI: 10.1021/jm900095y
BindingDB Entry DOI: 10.7270/Q2HX1DKJ
D(1A) dopamine receptor
(Homo sapiens (Human))
BDBM50378012
(CHEMBL1627310)
Show SMILES OC(CCNC(=O)c1cc2cc(F)ccc2[nH]1)CN1CCN(CC1)c1cccc(Cl)c1Cl
Show InChI InChI=1S/C23H25Cl2FN4O2/c24-18-2-1-3-21(22(18)25)30-10-8-29(9-11-30)14-17(31)6-7-27-23(32)20-13-15-12-16(26)4-5-19(15)28-20/h1-5,12-13,17,28,31H,6-11,14H2,(H,27,32)
>1.00E+4n/an/an/an/an/an/an/an/a
National Institute on Drug AbuseIntramural Research Program
Curated by ChEMBL
Assay Description
Displacement of [3H]SCH23390 from D1 receptor
J Med Chem 52: 2559-70 (2009)
Article DOI: 10.1021/jm900095y
BindingDB Entry DOI: 10.7270/Q2HX1DKJ
D(3) dopamine receptor
(Homo sapiens (Human))
BDBM50378012
(CHEMBL1627310)
Show SMILES OC(CCNC(=O)c1cc2cc(F)ccc2[nH]1)CN1CCN(CC1)c1cccc(Cl)c1Cl
Show InChI InChI=1S/C23H25Cl2FN4O2/c24-18-2-1-3-21(22(18)25)30-10-8-29(9-11-30)14-17(31)6-7-27-23(32)20-13-15-12-16(26)4-5-19(15)28-20/h1-5,12-13,17,28,31H,6-11,14H2,(H,27,32)
n/an/a 23.9n/an/an/an/an/an/a
National Institute on Drug AbuseIntramural Research Program
Curated by ChEMBL
Assay Description
Antagonist activity at human D3 receptor expressed in HEK293 cells assessed as inhibition of quinpirole-stimulated mitogenesis
J Med Chem 52: 2559-70 (2009)
Article DOI: 10.1021/jm900095y
BindingDB Entry DOI: 10.7270/Q2HX1DKJ