BDBM50378702 CHEMBL560895::SNX-2112
SMILES:
InChI Key: InChIKey=ZFVRYNYOPQZKDG-MQMHXKEQSA-N
Data: 4 KI  5 IC50  1 EC50
Activity Spreadsheet -- Enzyme Inhibition Constant Data from BindingDB
Found 10 hits for monomerid = 50378702
Trg + Lig
Ki
nM
ΔG°
kcal/mole
IC50
nM
Kd
nM
EC50/IC50
nM
koff
s-1
kon
M-1s-1
pHTemp
°C
Heat shock protein HSP 90-beta
(Homo sapiens (Human))
BDBM50378702
(CHEMBL560895 | SNX-2112)
Show InChI InChI=1S/C23H27F3N4O3/c1-22(2)10-17-19(18(32)11-22)20(23(24,25)26)29-30(17)13-5-8-15(21(27)33)16(9-13)28-12-3-6-14(31)7-4-12/h5,8-9,12,14,28,31H,3-4,6-7,10-11H2,1-2H3,(H2,27,33)/t12-,14-
Reactome pathway
1.10n/an/an/an/an/an/an/an/a
Biogen Idec Inc.
Curated by ChEMBL
Assay Description
Binding affinity to HSP90 under reducing conditions in presence of TECP
J Med Chem 53: 3-17 (2010)
Article DOI: 10.1021/jm9004708
BindingDB Entry DOI: 10.7270/Q2GM889J
Heat shock protein HSP 90-beta
(Homo sapiens (Human))
BDBM50378702
(CHEMBL560895 | SNX-2112)
Show InChI InChI=1S/C23H27F3N4O3/c1-22(2)10-17-19(18(32)11-22)20(23(24,25)26)29-30(17)13-5-8-15(21(27)33)16(9-13)28-12-3-6-14(31)7-4-12/h5,8-9,12,14,28,31H,3-4,6-7,10-11H2,1-2H3,(H2,27,33)/t12-,14-
Reactome pathway
2.80n/an/an/an/an/an/an/an/a
Biogen Idec Inc.
Curated by ChEMBL
Assay Description
Binding affinity to HSP90 under non-reducing conditions in absence of TECP
J Med Chem 53: 3-17 (2010)
Article DOI: 10.1021/jm9004708
BindingDB Entry DOI: 10.7270/Q2GM889J
Endoplasmin
(Homo sapiens (Human))
BDBM50378702
(CHEMBL560895 | SNX-2112)
Show InChI InChI=1S/C23H27F3N4O3/c1-22(2)10-17-19(18(32)11-22)20(23(24,25)26)29-30(17)13-5-8-15(21(27)33)16(9-13)28-12-3-6-14(31)7-4-12/h5,8-9,12,14,28,31H,3-4,6-7,10-11H2,1-2H3,(H2,27,33)/t12-,14-
484n/an/an/an/an/an/an/an/a
Vertex Pharmaceuticals
Curated by ChEMBL
Assay Description
Binding affinity to human N-terminal polyHis-tagged GRP94 (L69 to N337) expressed in Escherichia coli BL21(DE3) after 3 hrs by fluorescence polarizat...
Bioorg Med Chem Lett 24: 204-8 (2013)
Article DOI: 10.1016/j.bmcl.2013.11.036
BindingDB Entry DOI: 10.7270/Q2NP25WW
Heat shock protein 75 kDa, mitochondrial
(Homo sapiens (Human))
BDBM50378702
(CHEMBL560895 | SNX-2112)
Show InChI InChI=1S/C23H27F3N4O3/c1-22(2)10-17-19(18(32)11-22)20(23(24,25)26)29-30(17)13-5-8-15(21(27)33)16(9-13)28-12-3-6-14(31)7-4-12/h5,8-9,12,14,28,31H,3-4,6-7,10-11H2,1-2H3,(H2,27,33)/t12-,14-
791n/an/an/an/an/an/an/an/a
Vertex Pharmaceuticals
Curated by ChEMBL
Assay Description
Binding affinity to human recombinant TRAP1 after 3 hrs by fluorescence polarization assay
Bioorg Med Chem Lett 24: 204-8 (2013)
Article DOI: 10.1016/j.bmcl.2013.11.036
BindingDB Entry DOI: 10.7270/Q2NP25WW
Heat shock protein HSP 90-beta
(Homo sapiens (Human))
BDBM50378702
(CHEMBL560895 | SNX-2112)
Show InChI InChI=1S/C23H27F3N4O3/c1-22(2)10-17-19(18(32)11-22)20(23(24,25)26)29-30(17)13-5-8-15(21(27)33)16(9-13)28-12-3-6-14(31)7-4-12/h5,8-9,12,14,28,31H,3-4,6-7,10-11H2,1-2H3,(H2,27,33)/t12-,14-
Reactome pathway
n/an/a 7n/an/an/an/an/an/a
Biogen Idec Inc.
Curated by ChEMBL
Assay Description
Inhibition of HSP90-mediated client protein HER2 degradation
J Med Chem 53: 3-17 (2010)
Article DOI: 10.1021/jm9004708
BindingDB Entry DOI: 10.7270/Q2GM889J
Heat shock protein HSP 90-alpha
(Homo sapiens (Human))
BDBM50378702
(CHEMBL560895 | SNX-2112)
Show InChI InChI=1S/C23H27F3N4O3/c1-22(2)10-17-19(18(32)11-22)20(23(24,25)26)29-30(17)13-5-8-15(21(27)33)16(9-13)28-12-3-6-14(31)7-4-12/h5,8-9,12,14,28,31H,3-4,6-7,10-11H2,1-2H3,(H2,27,33)/t12-,14-
NCI pathway
Reactome pathway
n/an/an/an/a 19n/an/an/an/a
Biogen Idec Inc.
Curated by ChEMBL
Assay Description
Inhibition of HSP90alpha in human MCF7 cells assessed as degradation of Her-2
J Med Chem 55: 7786-95 (2012)
Article DOI: 10.1021/jm300810x
BindingDB Entry DOI: 10.7270/Q2V125Z3
Heat shock protein 75 kDa, mitochondrial
(Homo sapiens (Human))
BDBM50378702
(CHEMBL560895 | SNX-2112)
Show InChI InChI=1S/C23H27F3N4O3/c1-22(2)10-17-19(18(32)11-22)20(23(24,25)26)29-30(17)13-5-8-15(21(27)33)16(9-13)28-12-3-6-14(31)7-4-12/h5,8-9,12,14,28,31H,3-4,6-7,10-11H2,1-2H3,(H2,27,33)/t12-,14-
n/an/a 726n/an/an/an/an/an/a
Memorial Sloan-Kettering Cancer Center
Curated by ChEMBL
Assay Description
Displacement of 5-(3-(3-(6-amino-8-(6-iodobenzo[d][1,3]dioxol-5-ylthio)-9H-purin-9-yl)propyl)thioureido)-2-(6-hydroxy-3-oxo-3H-xanthen-9-yl)benzoic a...
J Med Chem 56: 6803-18 (2013)
Article DOI: 10.1021/jm400619b
BindingDB Entry DOI: 10.7270/Q2PN972K
Heat shock protein HSP 90-alpha
(Homo sapiens (Human))
BDBM50378702
(CHEMBL560895 | SNX-2112)
Show InChI InChI=1S/C23H27F3N4O3/c1-22(2)10-17-19(18(32)11-22)20(23(24,25)26)29-30(17)13-5-8-15(21(27)33)16(9-13)28-12-3-6-14(31)7-4-12/h5,8-9,12,14,28,31H,3-4,6-7,10-11H2,1-2H3,(H2,27,33)/t12-,14-
NCI pathway
Reactome pathway
n/an/a 3n/an/an/an/an/an/a
Biogen Idec Inc.
Curated by ChEMBL
Assay Description
Inhibition of Hsp90alpha
J Med Chem 55: 7786-95 (2012)
Article DOI: 10.1021/jm300810x
BindingDB Entry DOI: 10.7270/Q2V125Z3
Endoplasmin
(Canis familiaris)
BDBM50378702
(CHEMBL560895 | SNX-2112)
Show InChI InChI=1S/C23H27F3N4O3/c1-22(2)10-17-19(18(32)11-22)20(23(24,25)26)29-30(17)13-5-8-15(21(27)33)16(9-13)28-12-3-6-14(31)7-4-12/h5,8-9,12,14,28,31H,3-4,6-7,10-11H2,1-2H3,(H2,27,33)/t12-,14-
Reactome pathway
n/an/a 578n/an/an/an/an/an/a
Memorial Sloan-Kettering Cancer Center
Curated by ChEMBL
Assay Description
Displacement of 5-(3-(3-(6-amino-8-(6-iodobenzo[d][1,3]dioxol-5-ylthio)-9H-purin-9-yl)propyl)thioureido)-2-(6-hydroxy-3-oxo-3H-xanthen-9-yl)benzoic a...
J Med Chem 56: 6803-18 (2013)
Article DOI: 10.1021/jm400619b
BindingDB Entry DOI: 10.7270/Q2PN972K
Heat shock protein HSP 90-beta
(Homo sapiens (Human))
BDBM50378702
(CHEMBL560895 | SNX-2112)
Show InChI InChI=1S/C23H27F3N4O3/c1-22(2)10-17-19(18(32)11-22)20(23(24,25)26)29-30(17)13-5-8-15(21(27)33)16(9-13)28-12-3-6-14(31)7-4-12/h5,8-9,12,14,28,31H,3-4,6-7,10-11H2,1-2H3,(H2,27,33)/t12-,14-
Reactome pathway
n/an/a 22n/an/an/an/an/an/a
Biogen Idec Inc.
Curated by ChEMBL
Assay Description
Inhibition of HSP90-mediated client protein HER2 degradation in human MCF7 cells
J Med Chem 53: 3-17 (2010)
Article DOI: 10.1021/jm9004708
BindingDB Entry DOI: 10.7270/Q2GM889J