BDBM50378981 CHEMBL2011439
SMILES: Brc1ccc(OCc2ccccc2)c(CNCc2ccccn2)c1
InChI Key: InChIKey=CKZWAKFMBLJCHI-UHFFFAOYSA-N
Data: 1 Kd
Activity Spreadsheet -- Enzyme Inhibition Constant Data from BindingDB
Found 1 hit for monomerid = 50378981
Trg + Lig
Ki
nM
ΔG°
kcal/mole
IC50
nM
Kd
nM
EC50/IC50
nM
koff
s-1
kon
M-1s-1
pHTemp
°C
C-C chemokine receptor type 5
(Homo sapiens (Human))
BDBM50378981
(CHEMBL2011439)
Show SMILES Brc1ccc(OCc2ccccc2)c(CNCc2ccccn2)c1
Show InChI InChI=1S/C20H19BrN2O/c21-18-9-10-20(24-15-16-6-2-1-3-7-16)17(12-18)13-22-14-19-8-4-5-11-23-19/h1-12,22H,13-15H2
n/an/an/a 8.20E+3n/an/an/an/an/a
TBA
Curated by ChEMBL
Assay Description
Binding affinity to C-terminus C9-tagged immobilized CCR5 by SPR analysis
ACS Med Chem Lett 2: 549-554 (2011)
Article DOI: 10.1021/ml2000017
BindingDB Entry DOI: 10.7270/Q2X0682G