BDBM50379156 CHEMBL2012958::Genz-669178
SMILES: Cc1nc2c(cccc2n1-c1ccc(s1)C(=O)NC1CC1)C#N
InChI Key: InChIKey=XRXYHTFKWSMTFI-UHFFFAOYSA-N
Data: 8 IC50
PDB links: 1 PDB ID matches this monomer.
Activity Spreadsheet -- Enzyme Inhibition Constant Data from BindingDB
Found 8 hits for monomerid = 50379156
Trg + Lig
Ki
nM
ΔG°
kcal/mole
IC50
nM
Kd
nM
EC50/IC50
nM
koff
s-1
kon
M-1s-1
pHTemp
°C
Dihydroorotate dehydrogenase (quinone), mitochondrial
(Plasmodium falciparum (isolate 3D7))
BDBM50379156
(CHEMBL2012958 | Genz-669178)
Show SMILES Cc1nc2c(cccc2n1-c1ccc(s1)C(=O)NC1CC1)C#N
Show InChI InChI=1S/C17H14N4OS/c1-10-19-16-11(9-18)3-2-4-13(16)21(10)15-8-7-14(23-15)17(22)20-12-5-6-12/h2-4,7-8,12H,5-6H2,1H3,(H,20,22)
n/an/a 80n/an/an/an/an/an/a
Harvard School of Public Health
Assay Description
Substrate-dependent inhibition of recombinant PfDHODH protein was assessed in an in vitro assay in 384-well clear plates (Corning 3702) as described ...
J Biol Chem 289: 17980-95 (2014)
Article DOI: 10.1074/jbc.M114.558353
BindingDB Entry DOI: 10.7270/Q27P8X8G
3D
3D Structure (crystal)
Dihydroorotate dehydrogenase
(Homo sapiens (Human))
BDBM50379156
(CHEMBL2012958 | Genz-669178)
Show SMILES Cc1nc2c(cccc2n1-c1ccc(s1)C(=O)NC1CC1)C#N
Show InChI InChI=1S/C17H14N4OS/c1-10-19-16-11(9-18)3-2-4-13(16)21(10)15-8-7-14(23-15)17(22)20-12-5-6-12/h2-4,7-8,12H,5-6H2,1H3,(H,20,22)
Reactome pathway
n/an/a>3.00E+4n/an/an/an/an/an/a
Harvard School of Public Health
Assay Description
Substrate-dependent inhibition of recombinant PfDHODH protein was assessed in an in vitro assay in 384-well clear plates (Corning 3702) as described ...
J Biol Chem 289: 17980-95 (2014)
Article DOI: 10.1074/jbc.M114.558353
BindingDB Entry DOI: 10.7270/Q27P8X8G
Cytochrome P450 1A
(Homo sapiens (Human))
BDBM50379156
(CHEMBL2012958 | Genz-669178)
Show SMILES Cc1nc2c(cccc2n1-c1ccc(s1)C(=O)NC1CC1)C#N
Show InChI InChI=1S/C17H14N4OS/c1-10-19-16-11(9-18)3-2-4-13(16)21(10)15-8-7-14(23-15)17(22)20-12-5-6-12/h2-4,7-8,12H,5-6H2,1H3,(H,20,22)
Reactome pathway
n/an/a>1.00E+4n/an/an/an/an/an/a
TBA
Curated by ChEMBL
Assay Description
Inhibition of human CYP1A2 using phenacetin as substrate after 10 mins by LC-MS/MS analysis
ACS Med Chem Lett 2: 708-713 (2011)
Article DOI: 10.1021/ml200143c
BindingDB Entry DOI: 10.7270/Q2C24XDS
Potassium voltage-gated channel subfamily H member 2
(Homo sapiens (Human))
BDBM50379156
(CHEMBL2012958 | Genz-669178)
Show SMILES Cc1nc2c(cccc2n1-c1ccc(s1)C(=O)NC1CC1)C#N
Show InChI InChI=1S/C17H14N4OS/c1-10-19-16-11(9-18)3-2-4-13(16)21(10)15-8-7-14(23-15)17(22)20-12-5-6-12/h2-4,7-8,12H,5-6H2,1H3,(H,20,22)
Reactome pathway
n/an/a 5.30E+4n/an/an/an/an/an/a
TBA
Curated by ChEMBL
Assay Description
Inhibition of human ERG expressed in CHOK1 cells by whole cell voltage clamp assay
ACS Med Chem Lett 2: 708-713 (2011)
Article DOI: 10.1021/ml200143c
BindingDB Entry DOI: 10.7270/Q2C24XDS
Cytochrome P450 2C19
(Homo sapiens (Human))
BDBM50379156
(CHEMBL2012958 | Genz-669178)
Show SMILES Cc1nc2c(cccc2n1-c1ccc(s1)C(=O)NC1CC1)C#N
Show InChI InChI=1S/C17H14N4OS/c1-10-19-16-11(9-18)3-2-4-13(16)21(10)15-8-7-14(23-15)17(22)20-12-5-6-12/h2-4,7-8,12H,5-6H2,1H3,(H,20,22)
Reactome pathway
n/an/a>1.00E+4n/an/an/an/an/an/a
TBA
Curated by ChEMBL
Assay Description
Inhibition of human CYP2C19 using S-mephenytoin as substrate after 45 mins by LC-MS/MS analysis
ACS Med Chem Lett 2: 708-713 (2011)
Article DOI: 10.1021/ml200143c
BindingDB Entry DOI: 10.7270/Q2C24XDS
Cytochrome P450 3A4
(Homo sapiens (Human))
BDBM50379156
(CHEMBL2012958 | Genz-669178)
Show SMILES Cc1nc2c(cccc2n1-c1ccc(s1)C(=O)NC1CC1)C#N
Show InChI InChI=1S/C17H14N4OS/c1-10-19-16-11(9-18)3-2-4-13(16)21(10)15-8-7-14(23-15)17(22)20-12-5-6-12/h2-4,7-8,12H,5-6H2,1H3,(H,20,22)
Reactome pathway
n/an/a>1.00E+4n/an/an/an/an/an/a
TBA
Curated by ChEMBL
Assay Description
Inhibition of human CYP3A4 using midazolam as substrate after 5 mins by LC-MS/MS analysis
ACS Med Chem Lett 2: 708-713 (2011)
Article DOI: 10.1021/ml200143c
BindingDB Entry DOI: 10.7270/Q2C24XDS
Cytochrome P450 2D6
(Homo sapiens (Human))
BDBM50379156
(CHEMBL2012958 | Genz-669178)
Show SMILES Cc1nc2c(cccc2n1-c1ccc(s1)C(=O)NC1CC1)C#N
Show InChI InChI=1S/C17H14N4OS/c1-10-19-16-11(9-18)3-2-4-13(16)21(10)15-8-7-14(23-15)17(22)20-12-5-6-12/h2-4,7-8,12H,5-6H2,1H3,(H,20,22)
n/an/a>1.00E+4n/an/an/an/an/an/a
TBA
Curated by ChEMBL
Assay Description
Inhibition of human CYP2D6 using bufuralol as substrate after 10 mins by LC-MS/MS analysis
ACS Med Chem Lett 2: 708-713 (2011)
Article DOI: 10.1021/ml200143c
BindingDB Entry DOI: 10.7270/Q2C24XDS
Cytochrome P450 2C9
(Homo sapiens (Human))
BDBM50379156
(CHEMBL2012958 | Genz-669178)
Show SMILES Cc1nc2c(cccc2n1-c1ccc(s1)C(=O)NC1CC1)C#N
Show InChI InChI=1S/C17H14N4OS/c1-10-19-16-11(9-18)3-2-4-13(16)21(10)15-8-7-14(23-15)17(22)20-12-5-6-12/h2-4,7-8,12H,5-6H2,1H3,(H,20,22)
Reactome pathway
n/an/a>1.00E+4n/an/an/an/an/an/a
TBA
Curated by ChEMBL
Assay Description
Inhibition of human CYP2C9 using diclofenac as substrate after 10 mins by LC-MS/MS analysis
ACS Med Chem Lett 2: 708-713 (2011)
Article DOI: 10.1021/ml200143c
BindingDB Entry DOI: 10.7270/Q2C24XDS