BDBM50379866 CHEMBL2011874
SMILES: COc1ccc(cc1F)-c1nsc(NC(=O)[C@@H]2C[C@H]2C)c1C
InChI Key: InChIKey=OVLFPONZEJZITI-LDYMZIIASA-N
Data: 2 IC50
Activity Spreadsheet -- Enzyme Inhibition Constant Data from BindingDB
Found 2 hits for monomerid = 50379866
Trg + Lig
Ki
nM
ΔG°
kcal/mole
IC50
nM
Kd
nM
EC50/IC50
nM
koff
s-1
kon
M-1s-1
pHTemp
°C
Metabotropic glutamate receptor 5
(Homo sapiens (Human))
BDBM50379866
(CHEMBL2011874)
Show SMILES COc1ccc(cc1F)-c1nsc(NC(=O)[C@@H]2C[C@H]2C)c1C |r|
Show InChI InChI=1S/C16H17FN2O2S/c1-8-6-11(8)15(20)18-16-9(2)14(19-22-16)10-4-5-13(21-3)12(17)7-10/h4-5,7-8,11H,6H2,1-3H3,(H,18,20)/t8-,11-/m1/s1
n/an/a 159n/an/an/an/an/an/a
Lilly Research Laboratories
Curated by ChEMBL
Assay Description
Antagonist activity at human mGluR5
Bioorg Med Chem Lett 22: 2514-7 (2012)
Article DOI: 10.1016/j.bmcl.2012.02.003
BindingDB Entry DOI: 10.7270/Q2RX9D3G
Metabotropic glutamate receptor 1
(Homo sapiens (Human))
BDBM50379866
(CHEMBL2011874)
Show SMILES COc1ccc(cc1F)-c1nsc(NC(=O)[C@@H]2C[C@H]2C)c1C |r|
Show InChI InChI=1S/C16H17FN2O2S/c1-8-6-11(8)15(20)18-16-9(2)14(19-22-16)10-4-5-13(21-3)12(17)7-10/h4-5,7-8,11H,6H2,1-3H3,(H,18,20)/t8-,11-/m1/s1
n/an/a 7n/an/an/an/an/an/a
Lilly Research Laboratories
Curated by ChEMBL
Assay Description
Allosteric antagonist activity at human recombinant mGluR1 expressed in AV12 cells assessed as intracellular calcium concentration using Fluo-3 dye b...
Bioorg Med Chem Lett 22: 2514-7 (2012)
Article DOI: 10.1016/j.bmcl.2012.02.003
BindingDB Entry DOI: 10.7270/Q2RX9D3G