BDBM50380146 CHEMBL2010993
SMILES: CC(C)(C)c1cc(=O)[nH]c(SCC(=O)c2ccc(Cl)c(c2)S(N)(=O)=O)n1
InChI Key: InChIKey=RKXYDIJRXKLZIZ-UHFFFAOYSA-N
Data: 14 Kd
PDB links: 1 PDB ID matches this monomer.
Activity Spreadsheet -- Enzyme Inhibition Constant Data from BindingDB
Found 14 hits for monomerid = 50380146
Trg + Lig
Ki
nM
ΔG°
kcal/mole
IC50
nM
Kd
nM
EC50/IC50
nM
koff
s-1
kon
M-1s-1
pHTemp
°C
Carbonic anhydrase 2
(Homo sapiens (Human))
BDBM50380146
(CHEMBL2010993)
Show SMILES CC(C)(C)c1cc(=O)[nH]c(SCC(=O)c2ccc(Cl)c(c2)S(N)(=O)=O)n1
Show InChI InChI=1S/C16H18ClN3O4S2/c1-16(2,3)13-7-14(22)20-15(19-13)25-8-11(21)9-4-5-10(17)12(6-9)26(18,23)24/h4-7H,8H2,1-3H3,(H2,18,23,24)(H,19,20,22)
Reactome pathway
n/an/an/a 100n/an/an/an/an/a
Vilnius University
Curated by ChEMBL
Assay Description
Binding affinity to human recombinant carbonic anhydrase-2 by isothermal titration calorimetry assay
Eur J Med Chem 51: 259-70 (2012)
Article DOI: 10.1016/j.ejmech.2012.02.050
BindingDB Entry DOI: 10.7270/Q2FJ2HSF
3D
3D Structure (docked)
Carbonic anhydrase 13 (CA XIII)
(Homo sapiens (Human))
BDBM50380146
(CHEMBL2010993)
Show SMILES CC(C)(C)c1cc(=O)[nH]c(SCC(=O)c2ccc(Cl)c(c2)S(N)(=O)=O)n1
Show InChI InChI=1S/C16H18ClN3O4S2/c1-16(2,3)13-7-14(22)20-15(19-13)25-8-11(21)9-4-5-10(17)12(6-9)26(18,23)24/h4-7H,8H2,1-3H3,(H2,18,23,24)(H,19,20,22)
n/an/an/a 62n/an/an/an/an/a
Vilnius University
Curated by ChEMBL
Assay Description
Binding affinity to human recombinant carbonic anhydrase-13 by isothermal titration calorimetry assay
Eur J Med Chem 51: 259-70 (2012)
Article DOI: 10.1016/j.ejmech.2012.02.050
BindingDB Entry DOI: 10.7270/Q2FJ2HSF
Carbonic anhydrase 13 (CA XIII)
(Homo sapiens (Human))
BDBM50380146
(CHEMBL2010993)
Show SMILES CC(C)(C)c1cc(=O)[nH]c(SCC(=O)c2ccc(Cl)c(c2)S(N)(=O)=O)n1
Show InChI InChI=1S/C16H18ClN3O4S2/c1-16(2,3)13-7-14(22)20-15(19-13)25-8-11(21)9-4-5-10(17)12(6-9)26(18,23)24/h4-7H,8H2,1-3H3,(H2,18,23,24)(H,19,20,22)
n/an/an/a 25n/an/an/an/an/a
Vilnius University
Curated by ChEMBL
Assay Description
Binding affinity to human recombinant carbonic anhydrase-13 by thermal shift assay
Eur J Med Chem 51: 259-70 (2012)
Article DOI: 10.1016/j.ejmech.2012.02.050
BindingDB Entry DOI: 10.7270/Q2FJ2HSF
Carbonic anhydrase 7
(Homo sapiens (Human))
BDBM50380146
(CHEMBL2010993)
Show SMILES CC(C)(C)c1cc(=O)[nH]c(SCC(=O)c2ccc(Cl)c(c2)S(N)(=O)=O)n1
Show InChI InChI=1S/C16H18ClN3O4S2/c1-16(2,3)13-7-14(22)20-15(19-13)25-8-11(21)9-4-5-10(17)12(6-9)26(18,23)24/h4-7H,8H2,1-3H3,(H2,18,23,24)(H,19,20,22)
Reactome pathway
n/an/an/a 92n/an/an/an/an/a
Vilnius University
Curated by ChEMBL
Assay Description
Binding affinity to human recombinant carbonic anhydrase-7 by isothermal titration calorimetry assay
Eur J Med Chem 51: 259-70 (2012)
Article DOI: 10.1016/j.ejmech.2012.02.050
BindingDB Entry DOI: 10.7270/Q2FJ2HSF
Carbonic anhydrase 7
(Homo sapiens (Human))
BDBM50380146
(CHEMBL2010993)
Show SMILES CC(C)(C)c1cc(=O)[nH]c(SCC(=O)c2ccc(Cl)c(c2)S(N)(=O)=O)n1
Show InChI InChI=1S/C16H18ClN3O4S2/c1-16(2,3)13-7-14(22)20-15(19-13)25-8-11(21)9-4-5-10(17)12(6-9)26(18,23)24/h4-7H,8H2,1-3H3,(H2,18,23,24)(H,19,20,22)
Reactome pathway
n/an/an/a 20n/an/an/an/an/a
Vilnius University
Curated by ChEMBL
Assay Description
Binding affinity to human recombinant carbonic anhydrase-7 by thermal shift assay
Eur J Med Chem 51: 259-70 (2012)
Article DOI: 10.1016/j.ejmech.2012.02.050
BindingDB Entry DOI: 10.7270/Q2FJ2HSF
Carbonic anhydrase 2
(Homo sapiens (Human))
BDBM50380146
(CHEMBL2010993)
Show SMILES CC(C)(C)c1cc(=O)[nH]c(SCC(=O)c2ccc(Cl)c(c2)S(N)(=O)=O)n1
Show InChI InChI=1S/C16H18ClN3O4S2/c1-16(2,3)13-7-14(22)20-15(19-13)25-8-11(21)9-4-5-10(17)12(6-9)26(18,23)24/h4-7H,8H2,1-3H3,(H2,18,23,24)(H,19,20,22)
Reactome pathway
n/an/an/a 50n/an/an/an/an/a
Vilnius University
Curated by ChEMBL
Assay Description
Binding affinity to human recombinant carbonic anhydrase-2 by thermal shift assay
Eur J Med Chem 51: 259-70 (2012)
Article DOI: 10.1016/j.ejmech.2012.02.050
BindingDB Entry DOI: 10.7270/Q2FJ2HSF
3D
3D Structure (docked)
Carbonic anhydrase
(Homo sapiens (Human))
BDBM50380146
(CHEMBL2010993)
Show SMILES CC(C)(C)c1cc(=O)[nH]c(SCC(=O)c2ccc(Cl)c(c2)S(N)(=O)=O)n1
Show InChI InChI=1S/C16H18ClN3O4S2/c1-16(2,3)13-7-14(22)20-15(19-13)25-8-11(21)9-4-5-10(17)12(6-9)26(18,23)24/h4-7H,8H2,1-3H3,(H2,18,23,24)(H,19,20,22)
n/an/an/a 2.00E+3n/an/an/an/an/a
Vilnius University
Curated by ChEMBL
Assay Description
Binding affinity to human recombinant carbonic anhydrase 6 expressed in Escherichia coli Rosetta2 (DE3) by thermal shift assay
Bioorg Med Chem 21: 6937-47 (2013)
Article DOI: 10.1016/j.bmc.2013.09.029
BindingDB Entry DOI: 10.7270/Q2S46VZ9
Carbonic anhydrase 1
(Homo sapiens (Human))
BDBM50380146
(CHEMBL2010993)
Show SMILES CC(C)(C)c1cc(=O)[nH]c(SCC(=O)c2ccc(Cl)c(c2)S(N)(=O)=O)n1
Show InChI InChI=1S/C16H18ClN3O4S2/c1-16(2,3)13-7-14(22)20-15(19-13)25-8-11(21)9-4-5-10(17)12(6-9)26(18,23)24/h4-7H,8H2,1-3H3,(H2,18,23,24)(H,19,20,22)
NCI pathway
Reactome pathway
n/an/an/a 100n/an/an/an/an/a
Vilnius University
Curated by ChEMBL
Assay Description
Binding affinity to human recombinant carbonic anhydrase-1 by thermal shift assay
Eur J Med Chem 51: 259-70 (2012)
Article DOI: 10.1016/j.ejmech.2012.02.050
BindingDB Entry DOI: 10.7270/Q2FJ2HSF
Carbonic anhydrase
(Homo sapiens (Human))
BDBM50380146
(CHEMBL2010993)
Show SMILES CC(C)(C)c1cc(=O)[nH]c(SCC(=O)c2ccc(Cl)c(c2)S(N)(=O)=O)n1
Show InChI InChI=1S/C16H18ClN3O4S2/c1-16(2,3)13-7-14(22)20-15(19-13)25-8-11(21)9-4-5-10(17)12(6-9)26(18,23)24/h4-7H,8H2,1-3H3,(H2,18,23,24)(H,19,20,22)
NCI pathway
Reactome pathway
n/an/an/a 100n/an/an/an/an/a
Vilnius University
Curated by ChEMBL
Assay Description
Binding affinity to human recombinant carbonic anhydrase 1 expressed in Escherichia coli BL21 (DE3) by thermal shift assay
Bioorg Med Chem 21: 6937-47 (2013)
Article DOI: 10.1016/j.bmc.2013.09.029
BindingDB Entry DOI: 10.7270/Q2S46VZ9
Carbonic anhydrase
(Homo sapiens (Human))
BDBM50380146
(CHEMBL2010993)
Show SMILES CC(C)(C)c1cc(=O)[nH]c(SCC(=O)c2ccc(Cl)c(c2)S(N)(=O)=O)n1
Show InChI InChI=1S/C16H18ClN3O4S2/c1-16(2,3)13-7-14(22)20-15(19-13)25-8-11(21)9-4-5-10(17)12(6-9)26(18,23)24/h4-7H,8H2,1-3H3,(H2,18,23,24)(H,19,20,22)
n/an/an/a 25n/an/an/an/an/a
Vilnius University
Curated by ChEMBL
Assay Description
Binding affinity to human recombinant carbonic anhydrase 13 by thermal shift assay
Bioorg Med Chem 21: 6937-47 (2013)
Article DOI: 10.1016/j.bmc.2013.09.029
BindingDB Entry DOI: 10.7270/Q2S46VZ9
Carbonic anhydrase 2
(Homo sapiens (Human))
BDBM50380146
(CHEMBL2010993)
Show SMILES CC(C)(C)c1cc(=O)[nH]c(SCC(=O)c2ccc(Cl)c(c2)S(N)(=O)=O)n1
Show InChI InChI=1S/C16H18ClN3O4S2/c1-16(2,3)13-7-14(22)20-15(19-13)25-8-11(21)9-4-5-10(17)12(6-9)26(18,23)24/h4-7H,8H2,1-3H3,(H2,18,23,24)(H,19,20,22)
Reactome pathway
n/an/an/a 50n/an/an/an/an/a
Vilnius University
Curated by ChEMBL
Assay Description
Binding affinity to human recombinant carbonic anhydrase 2 by thermal shift assay
Bioorg Med Chem 21: 6937-47 (2013)
Article DOI: 10.1016/j.bmc.2013.09.029
BindingDB Entry DOI: 10.7270/Q2S46VZ9
3D
3D Structure (docked)
Carbonic anhydrase
(Homo sapiens (Human))
BDBM50380146
(CHEMBL2010993)
Show SMILES CC(C)(C)c1cc(=O)[nH]c(SCC(=O)c2ccc(Cl)c(c2)S(N)(=O)=O)n1
Show InChI InChI=1S/C16H18ClN3O4S2/c1-16(2,3)13-7-14(22)20-15(19-13)25-8-11(21)9-4-5-10(17)12(6-9)26(18,23)24/h4-7H,8H2,1-3H3,(H2,18,23,24)(H,19,20,22)
Reactome pathway
n/an/an/a 20n/an/an/an/an/a
Vilnius University
Curated by ChEMBL
Assay Description
Binding affinity to human recombinant carbonic anhydrase 7 by thermal shift assay
Bioorg Med Chem 21: 6937-47 (2013)
Article DOI: 10.1016/j.bmc.2013.09.029
BindingDB Entry DOI: 10.7270/Q2S46VZ9
Carbonic anhydrase
(Homo sapiens (Human))
BDBM50380146
(CHEMBL2010993)
Show SMILES CC(C)(C)c1cc(=O)[nH]c(SCC(=O)c2ccc(Cl)c(c2)S(N)(=O)=O)n1
Show InChI InChI=1S/C16H18ClN3O4S2/c1-16(2,3)13-7-14(22)20-15(19-13)25-8-11(21)9-4-5-10(17)12(6-9)26(18,23)24/h4-7H,8H2,1-3H3,(H2,18,23,24)(H,19,20,22)
Reactome pathway
n/an/an/a 44n/an/an/an/an/a
Vilnius University
Curated by ChEMBL
Assay Description
Binding affinity to human recombinant carbonic anhydrase 12 by thermal shift assay
Bioorg Med Chem 21: 6937-47 (2013)
Article DOI: 10.1016/j.bmc.2013.09.029
BindingDB Entry DOI: 10.7270/Q2S46VZ9
Carbonic anhydrase 1
(Homo sapiens (Human))
BDBM50380146
(CHEMBL2010993)
Show SMILES CC(C)(C)c1cc(=O)[nH]c(SCC(=O)c2ccc(Cl)c(c2)S(N)(=O)=O)n1
Show InChI InChI=1S/C16H18ClN3O4S2/c1-16(2,3)13-7-14(22)20-15(19-13)25-8-11(21)9-4-5-10(17)12(6-9)26(18,23)24/h4-7H,8H2,1-3H3,(H2,18,23,24)(H,19,20,22)
NCI pathway
Reactome pathway
n/an/an/a 240n/an/an/an/an/a
Vilnius University
Curated by ChEMBL
Assay Description
Binding affinity to human recombinant carbonic anhydrase-1 by isothermal titration calorimetry assay
Eur J Med Chem 51: 259-70 (2012)
Article DOI: 10.1016/j.ejmech.2012.02.050
BindingDB Entry DOI: 10.7270/Q2FJ2HSF