BDBM50380202 CHEMBL2011404
SMILES: [#6]-[#8]-c1ccc(cc1-[#8])-[#6@@H]-1-[#6]-[#6](=O)-c2c(-[#8])c(-[#6]\[#6]=[#6](/[#6])-[#6]-[#6]\[#6]=[#6](\[#6])-[#6])c(-[#8])cc2-[#8]-1
InChI Key: InChIKey=FVUVHWPNLPHERN-SICWBLJQSA-N
Data: 2 KI  3 IC50
Activity Spreadsheet -- Enzyme Inhibition Constant Data from BindingDB
Found 5 hits for monomerid = 50380202
Trg + Lig
Ki
nM
ΔG°
kcal/mole
IC50
nM
Kd
nM
EC50/IC50
nM
koff
s-1
kon
M-1s-1
pHTemp
°C
Butyrylcholinesterase (BChE)
(Equus caballus (Horse))
BDBM50380202
(CHEMBL2011404)
Show SMILES [#6]-[#8]-c1ccc(cc1-[#8])-[#6@@H]-1-[#6]-[#6](=O)-c2c(-[#8])c(-[#6]\[#6]=[#6](/[#6])-[#6]-[#6]\[#6]=[#6](\[#6])-[#6])c(-[#8])cc2-[#8]-1 |r|
Show InChI InChI=1S/C26H30O6/c1-15(2)6-5-7-16(3)8-10-18-19(27)13-24-25(26(18)30)21(29)14-23(32-24)17-9-11-22(31-4)20(28)12-17/h6,8-9,11-13,23,27-28,30H,5,7,10,14H2,1-4H3/b16-8+/t23-/m0/s1
2.35E+4n/an/an/an/an/an/an/an/a
Graduate School of Gyeongsang National University
Curated by ChEMBL
Assay Description
Mixed type inhibition of equine BChE using butyrylthiocholine iodide as substrate by Lineweaver-Burk double-reciprocal-plot and dixon plot analysis
Bioorg Med Chem 20: 2595-602 (2012)
Article DOI: 10.1016/j.bmc.2012.02.044
BindingDB Entry DOI: 10.7270/Q22808MC
Acetylcholinesterase
(Homo sapiens (Human))
BDBM50380202
(CHEMBL2011404)
Show SMILES [#6]-[#8]-c1ccc(cc1-[#8])-[#6@@H]-1-[#6]-[#6](=O)-c2c(-[#8])c(-[#6]\[#6]=[#6](/[#6])-[#6]-[#6]\[#6]=[#6](\[#6])-[#6])c(-[#8])cc2-[#8]-1 |r|
Show InChI InChI=1S/C26H30O6/c1-15(2)6-5-7-16(3)8-10-18-19(27)13-24-25(26(18)30)21(29)14-23(32-24)17-9-11-22(31-4)20(28)12-17/h6,8-9,11-13,23,27-28,30H,5,7,10,14H2,1-4H3/b16-8+/t23-/m0/s1
NCI pathway
Reactome pathway
9.45E+4n/an/an/an/an/an/an/an/a
Graduate School of Gyeongsang National University
Curated by ChEMBL
Assay Description
Mixed type inhibition of human erythrocyte AChE using acetylthiocholine iodide as substrate by Lineweaver-Burk double-reciprocal-plot and dixon plot ...
Bioorg Med Chem 20: 2595-602 (2012)
Article DOI: 10.1016/j.bmc.2012.02.044
BindingDB Entry DOI: 10.7270/Q22808MC
Leukocyte elastase
(Homo sapiens (Human))
BDBM50380202
(CHEMBL2011404)
Show SMILES [#6]-[#8]-c1ccc(cc1-[#8])-[#6@@H]-1-[#6]-[#6](=O)-c2c(-[#8])c(-[#6]\[#6]=[#6](/[#6])-[#6]-[#6]\[#6]=[#6](\[#6])-[#6])c(-[#8])cc2-[#8]-1 |r|
Show InChI InChI=1S/C26H30O6/c1-15(2)6-5-7-16(3)8-10-18-19(27)13-24-25(26(18)30)21(29)14-23(32-24)17-9-11-22(31-4)20(28)12-17/h6,8-9,11-13,23,27-28,30H,5,7,10,14H2,1-4H3/b16-8+/t23-/m0/s1
Reactome pathway
n/an/a 5.91E+4n/an/an/an/an/an/a
Korea Research Institute of Bioscience and Biotechnology
Curated by ChEMBL
Assay Description
Inhibition of human neutrophil elastase using MeOSuc-AAPV-pNA as substrate measured after 30 mins by spectrometric method
J Nat Prod 80: 2659-2665 (2017)
Article DOI: 10.1021/acs.jnatprod.7b00325
BindingDB Entry DOI: 10.7270/Q2RX9FK5
Acetylcholinesterase
(Homo sapiens (Human))
BDBM50380202
(CHEMBL2011404)
Show SMILES [#6]-[#8]-c1ccc(cc1-[#8])-[#6@@H]-1-[#6]-[#6](=O)-c2c(-[#8])c(-[#6]\[#6]=[#6](/[#6])-[#6]-[#6]\[#6]=[#6](\[#6])-[#6])c(-[#8])cc2-[#8]-1 |r|
Show InChI InChI=1S/C26H30O6/c1-15(2)6-5-7-16(3)8-10-18-19(27)13-24-25(26(18)30)21(29)14-23(32-24)17-9-11-22(31-4)20(28)12-17/h6,8-9,11-13,23,27-28,30H,5,7,10,14H2,1-4H3/b16-8+/t23-/m0/s1
NCI pathway
Reactome pathway
n/an/a 9.24E+4n/an/an/an/an/an/a
Graduate School of Gyeongsang National University
Curated by ChEMBL
Assay Description
Inhibition of human erythrocyte AChE assessed as acetylthiocholine iodide hydrolysis after 10 mins preincubation by spectrophotometry
Bioorg Med Chem 20: 2595-602 (2012)
Article DOI: 10.1016/j.bmc.2012.02.044
BindingDB Entry DOI: 10.7270/Q22808MC
Butyrylcholinesterase (BChE)
(Equus caballus (Horse))
BDBM50380202
(CHEMBL2011404)
Show SMILES [#6]-[#8]-c1ccc(cc1-[#8])-[#6@@H]-1-[#6]-[#6](=O)-c2c(-[#8])c(-[#6]\[#6]=[#6](/[#6])-[#6]-[#6]\[#6]=[#6](\[#6])-[#6])c(-[#8])cc2-[#8]-1 |r|
Show InChI InChI=1S/C26H30O6/c1-15(2)6-5-7-16(3)8-10-18-19(27)13-24-25(26(18)30)21(29)14-23(32-24)17-9-11-22(31-4)20(28)12-17/h6,8-9,11-13,23,27-28,30H,5,7,10,14H2,1-4H3/b16-8+/t23-/m0/s1
n/an/a 2.56E+4n/an/an/an/an/an/a
Graduate School of Gyeongsang National University
Curated by ChEMBL
Assay Description
Inhibition of equine BChE assessed as butyrylthiocholine iodide hydrolysis after 10 mins preincubation by spectrophotometry
Bioorg Med Chem 20: 2595-602 (2012)
Article DOI: 10.1016/j.bmc.2012.02.044
BindingDB Entry DOI: 10.7270/Q22808MC