BDBM50380282 CHEMBL2017250
SMILES: CSc1ccccc1Nc1nc(nc2c(NCC3CC3)ncnc12)N1CCC[C@H](N)C1
InChI Key: InChIKey=QIHGNXDRDHNVTP-HNNXBMFYSA-N
Data: 1 IC50
Activity Spreadsheet -- Enzyme Inhibition Constant Data from BindingDB
Found 1 hit for monomerid = 50380282
Trg + Lig
Ki
nM
ΔG°
kcal/mole
IC50
nM
Kd
nM
EC50/IC50
nM
koff
s-1
kon
M-1s-1
pHTemp
°C
Ketohexokinase (KHK) Isoform C
(Homo sapiens (Human))
BDBM50380282
(CHEMBL2017250)
Show SMILES CSc1ccccc1Nc1nc(nc2c(NCC3CC3)ncnc12)N1CCC[C@H](N)C1 |r|
Show InChI InChI=1S/C22H28N8S/c1-31-17-7-3-2-6-16(17)27-21-18-19(20(26-13-25-18)24-11-14-8-9-14)28-22(29-21)30-10-4-5-15(23)12-30/h2-3,6-7,13-15H,4-5,8-12,23H2,1H3,(H,24,25,26)(H,27,28,29)/t15-/m0/s1
n/an/a 23n/an/an/an/an/an/a
TBA
Curated by ChEMBL
Assay Description
Inhibition of human ketohexokinase isoform C expressed in Escherichia coli BL21 (DE3) cells using D-fructose as substrate after 12 to 15 mins by fluo...
ACS Med Chem Lett 2: 538-543 (2011)
Article DOI: 10.1021/ml200070g
BindingDB Entry DOI: 10.7270/Q2NZ88N1