BDBM50383199 CHEMBL2032027
SMILES: COCCn1c(C)c(C(=O)Nc2ccc(Oc3ccnc4cc(OC)ccc34)cn2)c(=O)n1-c1ccccc1
InChI Key: InChIKey=YKCLPZQBFQBZAH-UHFFFAOYSA-N
Data: 3 KI  1 IC50
Activity Spreadsheet -- Enzyme Inhibition Constant Data from BindingDB
Found 4 hits for monomerid = 50383199
Trg + Lig
Ki
nM
ΔG°
kcal/mole
IC50
nM
Kd
nM
EC50/IC50
nM
koff
s-1
kon
M-1s-1
pHTemp
°C
Hepatocyte growth factor receptor
(Homo sapiens (Human))
BDBM50383199
(CHEMBL2032027)
Show SMILES COCCn1c(C)c(C(=O)Nc2ccc(Oc3ccnc4cc(OC)ccc34)cn2)c(=O)n1-c1ccccc1
Show InChI InChI=1S/C29H27N5O5/c1-19-27(29(36)34(33(19)15-16-37-2)20-7-5-4-6-8-20)28(35)32-26-12-10-22(18-31-26)39-25-13-14-30-24-17-21(38-3)9-11-23(24)25/h4-14,17-18H,15-16H2,1-3H3,(H,31,32,35)
1.40n/an/an/an/an/an/an/an/a
Amgen Inc.
Curated by ChEMBL
Assay Description
Inhibition of c-Met by HTRF assay
J Med Chem 55: 1868-97 (2012)
Article DOI: 10.1021/jm201331s
BindingDB Entry DOI: 10.7270/Q23B616C
Vascular endothelial growth factor receptor 2
(Homo sapiens (Human))
BDBM50383199
(CHEMBL2032027)
Show SMILES COCCn1c(C)c(C(=O)Nc2ccc(Oc3ccnc4cc(OC)ccc34)cn2)c(=O)n1-c1ccccc1
Show InChI InChI=1S/C29H27N5O5/c1-19-27(29(36)34(33(19)15-16-37-2)20-7-5-4-6-8-20)28(35)32-26-12-10-22(18-31-26)39-25-13-14-30-24-17-21(38-3)9-11-23(24)25/h4-14,17-18H,15-16H2,1-3H3,(H,31,32,35)
NCI pathway
Reactome pathway
325n/an/an/an/an/an/an/an/a
Amgen Inc.
Curated by ChEMBL
Assay Description
Inhibition of VEGFR2 by HTRF assay
J Med Chem 55: 1868-97 (2012)
Article DOI: 10.1021/jm201331s
BindingDB Entry DOI: 10.7270/Q23B616C
Insulin-like growth factor I receptor
(Homo sapiens (Human))
BDBM50383199
(CHEMBL2032027)
Show SMILES COCCn1c(C)c(C(=O)Nc2ccc(Oc3ccnc4cc(OC)ccc34)cn2)c(=O)n1-c1ccccc1
Show InChI InChI=1S/C29H27N5O5/c1-19-27(29(36)34(33(19)15-16-37-2)20-7-5-4-6-8-20)28(35)32-26-12-10-22(18-31-26)39-25-13-14-30-24-17-21(38-3)9-11-23(24)25/h4-14,17-18H,15-16H2,1-3H3,(H,31,32,35)
Reactome pathway
2.89E+3n/an/an/an/an/an/an/an/a
Amgen Inc.
Curated by ChEMBL
Assay Description
Inhibition of IGF1R by HTRF assay
J Med Chem 55: 1868-97 (2012)
Article DOI: 10.1021/jm201331s
BindingDB Entry DOI: 10.7270/Q23B616C
Hepatocyte growth factor receptor
(Homo sapiens (Human))
BDBM50383199
(CHEMBL2032027)
Show SMILES COCCn1c(C)c(C(=O)Nc2ccc(Oc3ccnc4cc(OC)ccc34)cn2)c(=O)n1-c1ccccc1
Show InChI InChI=1S/C29H27N5O5/c1-19-27(29(36)34(33(19)15-16-37-2)20-7-5-4-6-8-20)28(35)32-26-12-10-22(18-31-26)39-25-13-14-30-24-17-21(38-3)9-11-23(24)25/h4-14,17-18H,15-16H2,1-3H3,(H,31,32,35)
n/an/a 89n/an/an/an/an/an/a
Amgen Inc.
Curated by ChEMBL
Assay Description
Inhibition of HGF-mediated c-Met autophosphorylation in human PC3 cells after 10 mins by quantitative electrochemiluminescent immunoassay
J Med Chem 55: 1868-97 (2012)
Article DOI: 10.1021/jm201331s
BindingDB Entry DOI: 10.7270/Q23B616C