BDBM50384007 CHEMBL2032297
SMILES: Nc1ncc(cc1-c1nc2cccc(-c3ccccn3)c2o1)-c1cnn(CCO)c1
InChI Key: InChIKey=VQAGNYIBYDXGLW-UHFFFAOYSA-N
Data: 1 IC50
Activity Spreadsheet -- Enzyme Inhibition Constant Data from BindingDB
Found 1 hit for monomerid = 50384007
Trg + Lig
Ki
nM
ΔG°
kcal/mole
IC50
nM
Kd
nM
EC50/IC50
nM
koff
s-1
kon
M-1s-1
pHTemp
°C
Hepatocyte growth factor receptor
(Homo sapiens (Human))
BDBM50384007
(CHEMBL2032297)
Show SMILES Nc1ncc(cc1-c1nc2cccc(-c3ccccn3)c2o1)-c1cnn(CCO)c1
Show InChI InChI=1S/C22H18N6O2/c23-21-17(10-14(11-25-21)15-12-26-28(13-15)8-9-29)22-27-19-6-3-4-16(20(19)30-22)18-5-1-2-7-24-18/h1-7,10-13,29H,8-9H2,(H2,23,25)
n/an/a 53n/an/an/an/an/an/a
Korea Research Institute of Chemical Technology
Curated by ChEMBL
Assay Description
Inhibition of recombinant c-Met by time resolved-fluorescence resonance energy transfer analysis
Bioorg Med Chem Lett 22: 4044-8 (2012)
Article DOI: 10.1016/j.bmcl.2012.04.083
BindingDB Entry DOI: 10.7270/Q2FF3TC4