null
SMILES: COc1ccc(CC(=NN)C(=O)NCCSC)cc1Br
InChI Key: InChIKey=WBAQWHOEJSDUNI-UHFFFAOYSA-N
Activity Spreadsheet -- Enzyme Inhibition Constant Data from BindingDB
Found 2 hits for monomerid = 50386469
Trg + Lig
Ki
nM
ΔG°
kcal/mole
IC50
nM
Kd
nM
EC50/IC50
nM
koff
s-1
kon
M-1s-1
pHTemp
°C
Histone deacetylase 6
(Homo sapiens (Human))
BDBM50386469
(CHEMBL2047677)
Show SMILES COc1ccc(CC(=NN)C(=O)NCCSC)cc1Br |w:8.8|
Show InChI InChI=1S/C13H18BrN3O2S/c1-19-12-4-3-9(7-10(12)14)8-11(17-15)13(18)16-5-6-20-2/h3-4,7H,5-6,8,15H2,1-2H3,(H,16,18)
NCI pathway
Reactome pathway
n/an/a>5.00E+4n/an/an/an/an/an/a
Imperial College London
Curated by ChEMBL
Assay Description
Inhibition of human recombinant HDAC6 using Boc-lys(Ac)-AMC as substrate preincubated for 20 mins with substrate measured after 60 mins by fluorescen...
J Med Chem 55: 1731-50 (2012)
Article DOI: 10.1021/jm2016182
BindingDB Entry DOI: 10.7270/Q22F7PHC
Histone deacetylase 1
(Homo sapiens (Human))
BDBM50386469
(CHEMBL2047677)
Show SMILES COc1ccc(CC(=NN)C(=O)NCCSC)cc1Br |w:8.8|
Show InChI InChI=1S/C13H18BrN3O2S/c1-19-12-4-3-9(7-10(12)14)8-11(17-15)13(18)16-5-6-20-2/h3-4,7H,5-6,8,15H2,1-2H3,(H,16,18)
NCI pathway
Reactome pathway
n/an/a 1.26E+4n/an/an/an/an/an/a
Imperial College London
Curated by ChEMBL
Assay Description
Inhibition of human recombinant HDAC1 using Boc-lys(Ac)-AMC as substrate preincubated for 20 mins with substrate measured after 60 mins by fluorescen...
J Med Chem 55: 1731-50 (2012)
Article DOI: 10.1021/jm2016182
BindingDB Entry DOI: 10.7270/Q22F7PHC