BDBM50386881 CHEMBL2048490
SMILES: CCc1ccc(Cc2ccc(OC)c(c2)[C@@H]2C[C@H](CO)[C@@H](O)[C@H](O)[C@H]2O)cc1
InChI Key: InChIKey=RAYPQIFWKYQIKX-HTKBXHQZSA-N
Data: 4 IC50
Activity Spreadsheet -- Enzyme Inhibition Constant Data from BindingDB
Found 4 hits for monomerid = 50386881
Trg + Lig
Ki
nM
ΔG°
kcal/mole
IC50
nM
Kd
nM
EC50/IC50
nM
koff
s-1
kon
M-1s-1
pHTemp
°C
Cytochrome P450 3A4
(Homo sapiens (Human))
BDBM50386881
(CHEMBL2048490)
Show SMILES CCc1ccc(Cc2ccc(OC)c(c2)[C@@H]2C[C@H](CO)[C@@H](O)[C@H](O)[C@H]2O)cc1 |r|
Show InChI InChI=1S/C23H30O5/c1-3-14-4-6-15(7-5-14)10-16-8-9-20(28-2)18(11-16)19-12-17(13-24)21(25)23(27)22(19)26/h4-9,11,17,19,21-27H,3,10,12-13H2,1-2H3/t17-,19+,21-,22+,23+/m1/s1
Reactome pathway
n/an/a>5.00E+4n/an/an/an/an/an/a
Chugai Pharmaceutical Co. Ltd
Curated by ChEMBL
Assay Description
Inhibition of CYP3A4 using BFC substrate in which compound added to reaction mixture before addition of BFC substrate by fluorometric assay
Bioorg Med Chem 20: 4117-27 (2012)
Article DOI: 10.1016/j.bmc.2012.04.053
BindingDB Entry DOI: 10.7270/Q26111CJ
Cytochrome P450 3A4
(Homo sapiens (Human))
BDBM50386881
(CHEMBL2048490)
Show SMILES CCc1ccc(Cc2ccc(OC)c(c2)[C@@H]2C[C@H](CO)[C@@H](O)[C@H](O)[C@H]2O)cc1 |r|
Show InChI InChI=1S/C23H30O5/c1-3-14-4-6-15(7-5-14)10-16-8-9-20(28-2)18(11-16)19-12-17(13-24)21(25)23(27)22(19)26/h4-9,11,17,19,21-27H,3,10,12-13H2,1-2H3/t17-,19+,21-,22+,23+/m1/s1
Reactome pathway
n/an/a>5.00E+4n/an/an/an/an/an/a
Chugai Pharmaceutical Co. Ltd
Curated by ChEMBL
Assay Description
Inhibition of CYP3A4 using BFC substrate in which compound added to reaction mixture simulatenously with BFC substrate by fluorometric assay
Bioorg Med Chem 20: 4117-27 (2012)
Article DOI: 10.1016/j.bmc.2012.04.053
BindingDB Entry DOI: 10.7270/Q26111CJ
Sodium/glucose cotransporter 1 (SGLT1)
(Homo sapiens (Human))
BDBM50386881
(CHEMBL2048490)
Show SMILES CCc1ccc(Cc2ccc(OC)c(c2)[C@@H]2C[C@H](CO)[C@@H](O)[C@H](O)[C@H]2O)cc1 |r|
Show InChI InChI=1S/C23H30O5/c1-3-14-4-6-15(7-5-14)10-16-8-9-20(28-2)18(11-16)19-12-17(13-24)21(25)23(27)22(19)26/h4-9,11,17,19,21-27H,3,10,12-13H2,1-2H3/t17-,19+,21-,22+,23+/m1/s1
n/an/a 7.30E+4n/an/an/an/an/an/a
Chugai Pharmaceutical Co. Ltd
Curated by ChEMBL
Assay Description
Inhibition of human SGLT1 expressed in CHO-K1 cells by [14C]AMG uptake assay
Bioorg Med Chem 20: 4117-27 (2012)
Article DOI: 10.1016/j.bmc.2012.04.053
BindingDB Entry DOI: 10.7270/Q26111CJ
Sodium/glucose cotransporter 2
(Homo sapiens (Human))
BDBM50386881
(CHEMBL2048490)
Show SMILES CCc1ccc(Cc2ccc(OC)c(c2)[C@@H]2C[C@H](CO)[C@@H](O)[C@H](O)[C@H]2O)cc1 |r|
Show InChI InChI=1S/C23H30O5/c1-3-14-4-6-15(7-5-14)10-16-8-9-20(28-2)18(11-16)19-12-17(13-24)21(25)23(27)22(19)26/h4-9,11,17,19,21-27H,3,10,12-13H2,1-2H3/t17-,19+,21-,22+,23+/m1/s1
n/an/a 12n/an/an/an/an/an/a
Chugai Pharmaceutical Co. Ltd
Curated by ChEMBL
Assay Description
Inhibition of human SGLT2 expressed in CHO-K1 cells by [14C]AMG uptake assay
Bioorg Med Chem 20: 4117-27 (2012)
Article DOI: 10.1016/j.bmc.2012.04.053
BindingDB Entry DOI: 10.7270/Q26111CJ