BDBM50388824 CHEMBL2062594
SMILES: CCCCCCCCCCCCCCCC(NCc1cccc(O)c1)=C1C(=O)OC(CO)C1=O
InChI Key: InChIKey=SJQLNZBCIVLZCU-UHFFFAOYSA-N
Data: 7 IC50
Activity Spreadsheet -- Enzyme Inhibition Constant Data from BindingDB
Found 7 hits for monomerid = 50388824
Trg + Lig
Ki
nM
ΔG°
kcal/mole
IC50
nM
Kd
nM
EC50/IC50
nM
koff
s-1
kon
M-1s-1
pHTemp
°C
Dual specificity protein phosphatase 6
(Homo sapiens (Human))
BDBM50388824
(CHEMBL2062594)
Show SMILES CCCCCCCCCCCCCCCC(NCc1cccc(O)c1)=C1C(=O)OC(CO)C1=O |w:15.15|
Show InChI InChI=1S/C28H43NO5/c1-2-3-4-5-6-7-8-9-10-11-12-13-14-18-24(26-27(32)25(21-30)34-28(26)33)29-20-22-16-15-17-23(31)19-22/h15-17,19,25,29-31H,2-14,18,20-21H2,1H3
Reactome pathway
n/an/a>1.00E+5n/an/an/an/an/an/a
TBA
Curated by ChEMBL
Assay Description
Inhibition of MKP3
ACS Med Chem Lett 3: 294-298 (2012)
Article DOI: 10.1021/ml2002778
BindingDB Entry DOI: 10.7270/Q2ZW1N0H
phosphatase Cdc25
(Homo sapiens (Human))
BDBM50388824
(CHEMBL2062594)
Show SMILES CCCCCCCCCCCCCCCC(NCc1cccc(O)c1)=C1C(=O)OC(CO)C1=O |w:15.15|
Show InChI InChI=1S/C28H43NO5/c1-2-3-4-5-6-7-8-9-10-11-12-13-14-18-24(26-27(32)25(21-30)34-28(26)33)29-20-22-16-15-17-23(31)19-22/h15-17,19,25,29-31H,2-14,18,20-21H2,1H3
Reactome pathway
n/an/a 1.54E+4n/an/an/an/an/an/a
TBA
Curated by ChEMBL
Assay Description
Inhibition of CDC25A
ACS Med Chem Lett 3: 294-298 (2012)
Article DOI: 10.1021/ml2002778
BindingDB Entry DOI: 10.7270/Q2ZW1N0H
Dual specificity phosphatase Cdc25B
(Homo sapiens (Human))
BDBM50388824
(CHEMBL2062594)
Show SMILES CCCCCCCCCCCCCCCC(NCc1cccc(O)c1)=C1C(=O)OC(CO)C1=O |w:15.15|
Show InChI InChI=1S/C28H43NO5/c1-2-3-4-5-6-7-8-9-10-11-12-13-14-18-24(26-27(32)25(21-30)34-28(26)33)29-20-22-16-15-17-23(31)19-22/h15-17,19,25,29-31H,2-14,18,20-21H2,1H3
Reactome pathway
n/an/a 3.15E+3n/an/an/an/an/an/a
TBA
Curated by ChEMBL
Assay Description
Inhibition of CDC25B
ACS Med Chem Lett 3: 294-298 (2012)
Article DOI: 10.1021/ml2002778
BindingDB Entry DOI: 10.7270/Q2ZW1N0H
Protein-tyrosine phosphatase 1B
(Homo sapiens (Human))
BDBM50388824
(CHEMBL2062594)
Show SMILES CCCCCCCCCCCCCCCC(NCc1cccc(O)c1)=C1C(=O)OC(CO)C1=O |w:15.15|
Show InChI InChI=1S/C28H43NO5/c1-2-3-4-5-6-7-8-9-10-11-12-13-14-18-24(26-27(32)25(21-30)34-28(26)33)29-20-22-16-15-17-23(31)19-22/h15-17,19,25,29-31H,2-14,18,20-21H2,1H3
NCI pathway
Reactome pathway
n/an/a>1.00E+5n/an/an/an/an/an/a
TBA
Curated by ChEMBL
Assay Description
Inhibition of PTP1B
ACS Med Chem Lett 3: 294-298 (2012)
Article DOI: 10.1021/ml2002778
BindingDB Entry DOI: 10.7270/Q2ZW1N0H
Dual specificity protein phosphatase (VHR)
(Homo sapiens (Human))
BDBM50388824
(CHEMBL2062594)
Show SMILES CCCCCCCCCCCCCCCC(NCc1cccc(O)c1)=C1C(=O)OC(CO)C1=O |w:15.15|
Show InChI InChI=1S/C28H43NO5/c1-2-3-4-5-6-7-8-9-10-11-12-13-14-18-24(26-27(32)25(21-30)34-28(26)33)29-20-22-16-15-17-23(31)19-22/h15-17,19,25,29-31H,2-14,18,20-21H2,1H3
Reactome pathway
n/an/a 1.11E+4n/an/an/an/an/an/a
TBA
Curated by ChEMBL
Assay Description
Inhibition of VHR
ACS Med Chem Lett 3: 294-298 (2012)
Article DOI: 10.1021/ml2002778
BindingDB Entry DOI: 10.7270/Q2ZW1N0H
Dual Specificity Protein Phosphatase 1
(Homo sapiens (Human))
BDBM50388824
(CHEMBL2062594)
Show SMILES CCCCCCCCCCCCCCCC(NCc1cccc(O)c1)=C1C(=O)OC(CO)C1=O |w:15.15|
Show InChI InChI=1S/C28H43NO5/c1-2-3-4-5-6-7-8-9-10-11-12-13-14-18-24(26-27(32)25(21-30)34-28(26)33)29-20-22-16-15-17-23(31)19-22/h15-17,19,25,29-31H,2-14,18,20-21H2,1H3
NCI pathway
n/an/a>1.00E+5n/an/an/an/an/an/a
TBA
Curated by ChEMBL
Assay Description
Inhibition of MKP1
ACS Med Chem Lett 3: 294-298 (2012)
Article DOI: 10.1021/ml2002778
BindingDB Entry DOI: 10.7270/Q2ZW1N0H
Cdc25C
(Homo sapiens (Human))
BDBM50388824
(CHEMBL2062594)
Show SMILES CCCCCCCCCCCCCCCC(NCc1cccc(O)c1)=C1C(=O)OC(CO)C1=O |w:15.15|
Show InChI InChI=1S/C28H43NO5/c1-2-3-4-5-6-7-8-9-10-11-12-13-14-18-24(26-27(32)25(21-30)34-28(26)33)29-20-22-16-15-17-23(31)19-22/h15-17,19,25,29-31H,2-14,18,20-21H2,1H3
n/an/a>1.00E+5n/an/an/an/an/an/a
TBA
Curated by ChEMBL
Assay Description
Inhibition of CDC25C
ACS Med Chem Lett 3: 294-298 (2012)
Article DOI: 10.1021/ml2002778
BindingDB Entry DOI: 10.7270/Q2ZW1N0H