BDBM50389539 CHEMBL2063382
SMILES: CCN(CC)c1ccc(C)c2nc(c(Cl)cc12)-c1c(OC)cc(COC)cc1OC
InChI Key: InChIKey=JMUWCILRZHRUPS-UHFFFAOYSA-N
Data: 4 IC50
Activity Spreadsheet -- Enzyme Inhibition Constant Data from BindingDB
Found 4 hits for monomerid = 50389539
Trg + Lig
Ki
nM
ΔG°
kcal/mole
IC50
nM
Kd
nM
EC50/IC50
nM
koff
s-1
kon
M-1s-1
pHTemp
°C
Corticotropin releasing factor receptor 1
(Homo sapiens (Human))
BDBM50389539
(CHEMBL2063382)
Show SMILES CCN(CC)c1ccc(C)c2nc(c(Cl)cc12)-c1c(OC)cc(COC)cc1OC |(62.06,-27.68,;63.4,-28.45,;63.41,-29.99,;64.74,-30.75,;64.75,-32.29,;62.08,-30.76,;60.74,-30,;59.41,-30.77,;59.41,-32.31,;58.08,-33.08,;60.74,-33.08,;60.74,-34.62,;62.07,-35.39,;63.41,-34.62,;64.75,-35.38,;63.41,-33.08,;62.08,-32.31,;62.08,-36.93,;60.74,-37.7,;59.41,-36.93,;58.07,-37.7,;60.74,-39.24,;62.07,-40.01,;62.08,-41.55,;60.74,-42.32,;59.41,-41.55,;63.41,-39.23,;63.41,-37.69,;64.74,-36.92,;66.07,-37.69,)|
Show InChI InChI=1S/C24H29ClN2O3/c1-7-27(8-2)19-10-9-15(3)23-17(19)13-18(25)24(26-23)22-20(29-5)11-16(14-28-4)12-21(22)30-6/h9-13H,7-8,14H2,1-6H3
Reactome pathway
n/an/a 45n/an/an/an/an/an/a
Eisai Co., Ltd
Curated by ChEMBL
Assay Description
Antagonist activity at human CRF1 receptor expressed in HEK293 cells assessed as inhibition of CRF-induced intracellular cAMP production preincubated...
Bioorg Med Chem 20: 6559-78 (2012)
Article DOI: 10.1016/j.bmc.2012.09.028
BindingDB Entry DOI: 10.7270/Q2B56KVZ
Corticotropin releasing factor receptor 1
(Homo sapiens (Human))
BDBM50389539
(CHEMBL2063382)
Show SMILES CCN(CC)c1ccc(C)c2nc(c(Cl)cc12)-c1c(OC)cc(COC)cc1OC |(62.06,-27.68,;63.4,-28.45,;63.41,-29.99,;64.74,-30.75,;64.75,-32.29,;62.08,-30.76,;60.74,-30,;59.41,-30.77,;59.41,-32.31,;58.08,-33.08,;60.74,-33.08,;60.74,-34.62,;62.07,-35.39,;63.41,-34.62,;64.75,-35.38,;63.41,-33.08,;62.08,-32.31,;62.08,-36.93,;60.74,-37.7,;59.41,-36.93,;58.07,-37.7,;60.74,-39.24,;62.07,-40.01,;62.08,-41.55,;60.74,-42.32,;59.41,-41.55,;63.41,-39.23,;63.41,-37.69,;64.74,-36.92,;66.07,-37.69,)|
Show InChI InChI=1S/C24H29ClN2O3/c1-7-27(8-2)19-10-9-15(3)23-17(19)13-18(25)24(26-23)22-20(29-5)11-16(14-28-4)12-21(22)30-6/h9-13H,7-8,14H2,1-6H3
Reactome pathway
n/an/a 45n/an/an/an/an/an/a
Eisai Co., Ltd
Curated by ChEMBL
Assay Description
Antagonist activity at human CRF1 receptor expressed in HEK293 cells assessed as inhibition of CRF-stimulated intracellular cAMP accumulation after 3...
Bioorg Med Chem Lett 22: 5372-8 (2012)
Article DOI: 10.1016/j.bmcl.2012.07.047
BindingDB Entry DOI: 10.7270/Q2736S12
Corticotropin releasing factor receptor 1
(Homo sapiens (Human))
BDBM50389539
(CHEMBL2063382)
Show SMILES CCN(CC)c1ccc(C)c2nc(c(Cl)cc12)-c1c(OC)cc(COC)cc1OC |(62.06,-27.68,;63.4,-28.45,;63.41,-29.99,;64.74,-30.75,;64.75,-32.29,;62.08,-30.76,;60.74,-30,;59.41,-30.77,;59.41,-32.31,;58.08,-33.08,;60.74,-33.08,;60.74,-34.62,;62.07,-35.39,;63.41,-34.62,;64.75,-35.38,;63.41,-33.08,;62.08,-32.31,;62.08,-36.93,;60.74,-37.7,;59.41,-36.93,;58.07,-37.7,;60.74,-39.24,;62.07,-40.01,;62.08,-41.55,;60.74,-42.32,;59.41,-41.55,;63.41,-39.23,;63.41,-37.69,;64.74,-36.92,;66.07,-37.69,)|
Show InChI InChI=1S/C24H29ClN2O3/c1-7-27(8-2)19-10-9-15(3)23-17(19)13-18(25)24(26-23)22-20(29-5)11-16(14-28-4)12-21(22)30-6/h9-13H,7-8,14H2,1-6H3
Reactome pathway
n/an/a 81n/an/an/an/an/an/a
Eisai Co., Ltd
Curated by ChEMBL
Assay Description
Displacement of [125I]-CRF from human CRF1 receptor expressed in HEK293 cells after 2 hrs
Bioorg Med Chem Lett 22: 5372-8 (2012)
Article DOI: 10.1016/j.bmcl.2012.07.047
BindingDB Entry DOI: 10.7270/Q2736S12
Corticotropin releasing factor receptor 1
(Homo sapiens (Human))
BDBM50389539
(CHEMBL2063382)
Show SMILES CCN(CC)c1ccc(C)c2nc(c(Cl)cc12)-c1c(OC)cc(COC)cc1OC |(62.06,-27.68,;63.4,-28.45,;63.41,-29.99,;64.74,-30.75,;64.75,-32.29,;62.08,-30.76,;60.74,-30,;59.41,-30.77,;59.41,-32.31,;58.08,-33.08,;60.74,-33.08,;60.74,-34.62,;62.07,-35.39,;63.41,-34.62,;64.75,-35.38,;63.41,-33.08,;62.08,-32.31,;62.08,-36.93,;60.74,-37.7,;59.41,-36.93,;58.07,-37.7,;60.74,-39.24,;62.07,-40.01,;62.08,-41.55,;60.74,-42.32,;59.41,-41.55,;63.41,-39.23,;63.41,-37.69,;64.74,-36.92,;66.07,-37.69,)|
Show InChI InChI=1S/C24H29ClN2O3/c1-7-27(8-2)19-10-9-15(3)23-17(19)13-18(25)24(26-23)22-20(29-5)11-16(14-28-4)12-21(22)30-6/h9-13H,7-8,14H2,1-6H3
Reactome pathway
n/an/a 81n/an/an/an/an/an/a
Eisai Co., Ltd
Curated by ChEMBL
Assay Description
Displacement of [125I]-CRF from human CRF1 receptor expressed in HEK293 cells after 2 hrs by scintillation counting
Bioorg Med Chem 20: 6559-78 (2012)
Article DOI: 10.1016/j.bmc.2012.09.028
BindingDB Entry DOI: 10.7270/Q2B56KVZ