BDBM50390950 CHEMBL2071147
SMILES: [O-][n+]1nn(c(Br)c1Cl)-c1ccccc1
InChI Key: InChIKey=RWCIBYPJGKLOON-UHFFFAOYSA-N
Data: 1 KI  1 IC50
Activity Spreadsheet -- Enzyme Inhibition Constant Data from BindingDB
Found 2 hits for monomerid = 50390950
Trg + Lig
Ki
nM
ΔG°
kcal/mole
IC50
nM
Kd
nM
EC50/IC50
nM
koff
s-1
kon
M-1s-1
pHTemp
°C
Lysine-specific demethylase 4C
(Homo sapiens (Human))
BDBM50390950
(CHEMBL2071147)
Show SMILES [O-][n+]1nn(c(Br)c1Cl)-c1ccccc1
Show InChI InChI=1S/C8H5BrClN3O/c9-7-8(10)13(14)11-12(7)6-4-2-1-3-5-6/h1-5H
>2.00E+5n/an/an/an/an/an/an/an/a
University of Copenhagen
Curated by ChEMBL
Assay Description
Inhibition of KDM4C catalytic core-mediated demethylation of ARK(Me)3STGGK after 30 mins by FDH-coupled assay
Bioorg Med Chem Lett 22: 5811-3 (2012)
Article DOI: 10.1016/j.bmcl.2012.07.091
BindingDB Entry DOI: 10.7270/Q2222VV7
Lysine-specific demethylase 4C
(Homo sapiens (Human))
BDBM50390950
(CHEMBL2071147)
Show SMILES [O-][n+]1nn(c(Br)c1Cl)-c1ccccc1
Show InChI InChI=1S/C8H5BrClN3O/c9-7-8(10)13(14)11-12(7)6-4-2-1-3-5-6/h1-5H
n/an/a>2.00E+5n/an/an/an/an/an/a
University of Copenhagen
Curated by ChEMBL
Assay Description
Inhibition of KDM4C catalytic core-mediated demethylation of ARK(Me)3STGGK after 30 mins by FDH-coupled assay
Bioorg Med Chem Lett 22: 5811-3 (2012)
Article DOI: 10.1016/j.bmcl.2012.07.091
BindingDB Entry DOI: 10.7270/Q2222VV7