null
SMILES: CC(C)N(CCO)Cc1coc2cccc(OCC3CCCCC3)c2c1=O
InChI Key: InChIKey=OGCSNFFNLCCVLC-UHFFFAOYSA-N
Activity Spreadsheet -- Enzyme Inhibition Constant Data from BindingDB
Found 1 hit for monomerid = 50391553
Trg + Lig
Ki
nM
ΔG°
kcal/mole
IC50
nM
Kd
nM
EC50/IC50
nM
koff
s-1
kon
M-1s-1
pHTemp
°C
Interleukin-5
(Mus musculus)
BDBM50391553
(CHEMBL2147493)
Show SMILES CC(C)N(CCO)Cc1coc2cccc(OCC3CCCCC3)c2c1=O
Show InChI InChI=1S/C22H31NO4/c1-16(2)23(11-12-24)13-18-15-27-20-10-6-9-19(21(20)22(18)25)26-14-17-7-4-3-5-8-17/h6,9-10,15-17,24H,3-5,7-8,11-14H2,1-2H3
Reactome pathway
n/an/a 1.02E+4n/an/an/an/an/an/a
Chungnam National University
Curated by ChEMBL
Assay Description
Inhibition of IL-5 in mouse Y16 cells after 48 hrs by WST1 assay
Bioorg Med Chem 20: 5757-62 (2012)
Article DOI: 10.1016/j.bmc.2012.08.006
BindingDB Entry DOI: 10.7270/Q2PG1SSV