BDBM50391716 CHEMBL2146978
SMILES: COC(=O)C(C)(C)C(c1ccc(Nc2ccc(F)cc2)cc1)n1ccnc1
InChI Key: InChIKey=JCSZGGFDFBJQKT-UHFFFAOYSA-N
Data: 1 IC50
Activity Spreadsheet -- Enzyme Inhibition Constant Data from BindingDB
Found 1 hit for monomerid = 50391716
Trg + Lig
Ki
nM
ΔG°
kcal/mole
IC50
nM
Kd
nM
EC50/IC50
nM
koff
s-1
kon
M-1s-1
pHTemp
°C
Cytochrome CYP26A1
(Homo sapiens (Human))
BDBM50391716
(CHEMBL2146978)
Show SMILES COC(=O)C(C)(C)C(c1ccc(Nc2ccc(F)cc2)cc1)n1ccnc1
Show InChI InChI=1S/C21H22FN3O2/c1-21(2,20(26)27-3)19(25-13-12-23-14-25)15-4-8-17(9-5-15)24-18-10-6-16(22)7-11-18/h4-14,19,24H,1-3H3
Reactome pathway
n/an/a 250n/an/an/an/an/an/a
Cardiff University
Curated by ChEMBL
Assay Description
Inhibition of CYP26A1-mediated retionic acid metabolism in human MCF7 cell microsomes using [3H]ATRA as substrate after 1 hr by scintillation countin...
Bioorg Med Chem 20: 6080-8 (2012)
Article DOI: 10.1016/j.bmc.2012.08.044
BindingDB Entry DOI: 10.7270/Q2D21ZQD