BDBM50391803 CHEMBL2146888
SMILES: NCC1(O)CN(C1)C(=O)c1ccc(F)c(F)c1Nc1ccc(I)cc1F
InChI Key: InChIKey=GLTAPZSWBNABCW-UHFFFAOYSA-N
Data: 2 IC50
PDB links: 1 PDB ID matches this monomer.
Activity Spreadsheet -- Enzyme Inhibition Constant Data from BindingDB
Found 2 hits for monomerid = 50391803
Trg + Lig
Ki
nM
ΔG°
kcal/mole
IC50
nM
Kd
nM
EC50/IC50
nM
koff
s-1
kon
M-1s-1
pHTemp
°C
Dual specificity mitogen-activated protein kinase kinase 1/Mitogen-activated protein kinase 1/RAF proto-oncogene serine/threonine-protein kinase
(Homo sapiens (Human))
BDBM50391803
(CHEMBL2146888)
Show SMILES NCC1(O)CN(C1)C(=O)c1ccc(F)c(F)c1Nc1ccc(I)cc1F
Show InChI InChI=1S/C17H15F3IN3O2/c18-11-3-2-10(16(25)24-7-17(26,6-22)8-24)15(14(11)20)23-13-4-1-9(21)5-12(13)19/h1-5,23,26H,6-8,22H2
Reactome pathway
n/an/a 6.60n/an/an/an/an/an/a
Boston University
Curated by ChEMBL
Assay Description
Inhibition of MEK1 (unknown origin)
J Med Chem 62: 10005-10025 (2019)
Article DOI: 10.1021/acs.jmedchem.8b01732
3D
3D Structure (crystal)
Dual specificity mitogen-activated protein kinase kinase 1
(Homo sapiens (Human))
BDBM50391803
(CHEMBL2146888)
Show SMILES NCC1(O)CN(C1)C(=O)c1ccc(F)c(F)c1Nc1ccc(I)cc1F
Show InChI InChI=1S/C17H15F3IN3O2/c18-11-3-2-10(16(25)24-7-17(26,6-22)8-24)15(14(11)20)23-13-4-1-9(21)5-12(13)19/h1-5,23,26H,6-8,22H2
Reactome pathway
n/an/a 6.60n/an/an/an/an/an/a
TBA
Curated by ChEMBL
Assay Description
Inhibition of MEK1-mediated ERK2 T202/Y204 phosphorylation using biotinylated MBP as substrate preincubated for 30 mins measured after 100 mins by cR...
ACS Med Chem Lett 3: 416-421 (2012)
Article DOI: 10.1021/ml300049d
BindingDB Entry DOI: 10.7270/Q2GT5P80
3D
3D Structure (crystal)