BDBM50392983 CHEMBL2152383
SMILES: COC(=O)c1c(Cc2ccc(cc2)C(=O)N[C@H]2[C@H]3C[C@H]4C[C@@H]2C[C@](O)(C4)C3)c(=O)c2cccnc2n1-c1ccccc1
InChI Key: InChIKey=CGFYLKFEYRNNFI-CJYKQNLHSA-N
Data: 1 IC50  1 EC50
Activity Spreadsheet -- Enzyme Inhibition Constant Data from BindingDB
Found 2 hits for monomerid = 50392983
Trg + Lig
Ki
nM
ΔG°
kcal/mole
IC50
nM
Kd
nM
EC50/IC50
nM
koff
s-1
kon
M-1s-1
pHTemp
°C
Mitogen-activated protein kinase 8
(Homo sapiens (Human))
BDBM50392983
(CHEMBL2152383)
Show SMILES COC(=O)c1c(Cc2ccc(cc2)C(=O)N[C@H]2[C@H]3C[C@H]4C[C@@H]2C[C@](O)(C4)C3)c(=O)c2cccnc2n1-c1ccccc1 |r,TLB:26:23:20:16.17.18,THB:18:17:22:20.19.25,18:19:16.17.26:22,15:16:22:20.19.25,24:23:20:16.17.18|
Show InChI InChI=1S/C34H33N3O5/c1-42-33(40)29-27(30(38)26-8-5-13-35-31(26)37(29)25-6-3-2-4-7-25)16-20-9-11-22(12-10-20)32(39)36-28-23-14-21-15-24(28)19-34(41,17-21)18-23/h2-13,21,23-24,28,41H,14-19H2,1H3,(H,36,39)/t21-,23-,24+,28-,34-
NCI pathway
Reactome pathway
n/an/an/an/a 4.10E+3n/an/an/an/a
TBA
Curated by ChEMBL
Assay Description
Inhibition of JNK1-mediated c-jun phosphorylation in TNF-alpha stimulated human HK-2 cells after 30 mins by TR-FRET assay
ACS Med Chem Lett 3: 764-768 (2012)
Article DOI: 10.1021/ml300175c
BindingDB Entry DOI: 10.7270/Q22808P8
Mitogen-activated protein kinase 8
(Homo sapiens (Human))
BDBM50392983
(CHEMBL2152383)
Show SMILES COC(=O)c1c(Cc2ccc(cc2)C(=O)N[C@H]2[C@H]3C[C@H]4C[C@@H]2C[C@](O)(C4)C3)c(=O)c2cccnc2n1-c1ccccc1 |r,TLB:26:23:20:16.17.18,THB:18:17:22:20.19.25,18:19:16.17.26:22,15:16:22:20.19.25,24:23:20:16.17.18|
Show InChI InChI=1S/C34H33N3O5/c1-42-33(40)29-27(30(38)26-8-5-13-35-31(26)37(29)25-6-3-2-4-7-25)16-20-9-11-22(12-10-20)32(39)36-28-23-14-21-15-24(28)19-34(41,17-21)18-23/h2-13,21,23-24,28,41H,14-19H2,1H3,(H,36,39)/t21-,23-,24+,28-,34-
NCI pathway
Reactome pathway
n/an/a 12n/an/an/an/an/an/a
TBA
Curated by ChEMBL
Assay Description
Inhibition of JNK1 after 30 mins by TR-FRET assay
ACS Med Chem Lett 3: 764-768 (2012)
Article DOI: 10.1021/ml300175c
BindingDB Entry DOI: 10.7270/Q22808P8