BDBM50394909 CHEMBL2165513
SMILES: CC(C)(N1CCN(Cc2cc3nc(nc(N4CCOCC4)c3s2)-c2ccnc3[nH]ccc23)CC1)C(N)=O
InChI Key: InChIKey=FMMAYYQMOFCNPH-UHFFFAOYSA-N
Data: 1 IC50
Activity Spreadsheet -- Enzyme Inhibition Constant Data from BindingDB
Found 1 hit for monomerid = 50394909
Trg + Lig
Ki
nM
ΔG°
kcal/mole
IC50
nM
Kd
nM
EC50/IC50
nM
koff
s-1
kon
M-1s-1
pHTemp
°C
Phosphatidylinositol 4,5-bisphosphate 3-kinase catalytic subunit delta isoform
(Homo sapiens (Human))
BDBM50394909
(CHEMBL2165513)
Show SMILES CC(C)(N1CCN(Cc2cc3nc(nc(N4CCOCC4)c3s2)-c2ccnc3[nH]ccc23)CC1)C(N)=O
Show InChI InChI=1S/C26H32N8O2S/c1-26(2,25(27)35)34-9-7-32(8-10-34)16-17-15-20-21(37-17)24(33-11-13-36-14-12-33)31-23(30-20)19-4-6-29-22-18(19)3-5-28-22/h3-6,15H,7-14,16H2,1-2H3,(H2,27,35)(H,28,29)
NCI pathway
Reactome pathway
n/an/a 2.30n/an/an/an/an/an/a
Genentech
Curated by ChEMBL
Assay Description
Binding affinity to PI3Kdelta after 30 mins by competitive fluorescence polarization assay
J Med Chem 55: 5887-900 (2012)
Article DOI: 10.1021/jm3003747
BindingDB Entry DOI: 10.7270/Q2V125XN