BDBM50395142 CHEMBL2163579
SMILES: CC[C@@H]1COc2cccc3c2n1cc(C(=O)NC12CC4CC(CC(C4)C1)C2)c3=O
InChI Key: InChIKey=ZJPHCFVVUDEEFO-HHUAMSDTSA-N
Data: 4 KI  1 IC50
Activity Spreadsheet -- Enzyme Inhibition Constant Data from BindingDB
Found 5 hits for monomerid = 50395142
Trg + Lig
Ki
nM
ΔG°
kcal/mole
IC50
nM
Kd
nM
EC50/IC50
nM
koff
s-1
kon
M-1s-1
pHTemp
°C
Cannabinoid receptor 2
(Homo sapiens (Human))
BDBM50395142
(CHEMBL2163579)
Show SMILES CC[C@@H]1COc2cccc3c2n1cc(C(=O)NC12CC4CC(CC(C4)C1)C2)c3=O |r,THB:22:21:18:24.23.25,22:23:20.21.26:18,25:23:20:26.17.18,25:17:20:24.22.23|
Show InChI InChI=1S/C24H28N2O3/c1-2-17-13-29-20-5-3-4-18-21(20)26(17)12-19(22(18)27)23(28)25-24-9-14-6-15(10-24)8-16(7-14)11-24/h3-5,12,14-17H,2,6-11,13H2,1H3,(H,25,28)/t14?,15?,16?,17-,24?/m1/s1
Reactome pathway
4.93n/an/an/an/an/an/an/an/a
Universit£ di Ferrara
Curated by ChEMBL
Assay Description
Displacement of [3H]CP-55940 from human recombinant CB2 receptor expressed in CHO cell membranes incubated for 60 mins by scintillation counting
J Med Chem 55: 6608-23 (2012)
Article DOI: 10.1021/jm300763w
BindingDB Entry DOI: 10.7270/Q2WS8VCX
Cannabinoid receptor 2
(Rattus norvegicus (Rat))
BDBM50395142
(CHEMBL2163579)
Show SMILES CC[C@@H]1COc2cccc3c2n1cc(C(=O)NC12CC4CC(CC(C4)C1)C2)c3=O |r,THB:22:21:18:24.23.25,22:23:20.21.26:18,25:23:20:26.17.18,25:17:20:24.22.23|
Show InChI InChI=1S/C24H28N2O3/c1-2-17-13-29-20-5-3-4-18-21(20)26(17)12-19(22(18)27)23(28)25-24-9-14-6-15(10-24)8-16(7-14)11-24/h3-5,12,14-17H,2,6-11,13H2,1H3,(H,25,28)/t14?,15?,16?,17-,24?/m1/s1
6.17n/an/an/an/an/an/an/an/a
Universit£ di Ferrara
Curated by ChEMBL
Assay Description
Displacement of [3H]CP-55940 from CB2 receptor in Sprague-Dawley rat spleen by scintillation counting
J Med Chem 55: 6608-23 (2012)
Article DOI: 10.1021/jm300763w
BindingDB Entry DOI: 10.7270/Q2WS8VCX
Cannabinoid receptor 1
(Homo sapiens (Human))
BDBM50395142
(CHEMBL2163579)
Show SMILES CC[C@@H]1COc2cccc3c2n1cc(C(=O)NC12CC4CC(CC(C4)C1)C2)c3=O |r,THB:22:21:18:24.23.25,22:23:20.21.26:18,25:23:20:26.17.18,25:17:20:24.22.23|
Show InChI InChI=1S/C24H28N2O3/c1-2-17-13-29-20-5-3-4-18-21(20)26(17)12-19(22(18)27)23(28)25-24-9-14-6-15(10-24)8-16(7-14)11-24/h3-5,12,14-17H,2,6-11,13H2,1H3,(H,25,28)/t14?,15?,16?,17-,24?/m1/s1
NCI pathway
Reactome pathway
197n/an/an/an/an/an/an/an/a
Universit£ di Ferrara
Curated by ChEMBL
Assay Description
Displacement of [3H]CP-55940 from human recombinant CB1 receptor expressed in CHO cell membranes incubated for 90 mins by scintillation counting
J Med Chem 55: 6608-23 (2012)
Article DOI: 10.1021/jm300763w
BindingDB Entry DOI: 10.7270/Q2WS8VCX
Cannabinoid receptor 1
(Rattus norvegicus (rat))
BDBM50395142
(CHEMBL2163579)
Show SMILES CC[C@@H]1COc2cccc3c2n1cc(C(=O)NC12CC4CC(CC(C4)C1)C2)c3=O |r,THB:22:21:18:24.23.25,22:23:20.21.26:18,25:23:20:26.17.18,25:17:20:24.22.23|
Show InChI InChI=1S/C24H28N2O3/c1-2-17-13-29-20-5-3-4-18-21(20)26(17)12-19(22(18)27)23(28)25-24-9-14-6-15(10-24)8-16(7-14)11-24/h3-5,12,14-17H,2,6-11,13H2,1H3,(H,25,28)/t14?,15?,16?,17-,24?/m1/s1
Reactome pathway
242n/an/an/an/an/an/an/an/a
Universit£ di Ferrara
Curated by ChEMBL
Assay Description
Displacement of [3H]CP-55940 from CB1 receptor in Sprague-Dawley rat brain by scintillation counting
J Med Chem 55: 6608-23 (2012)
Article DOI: 10.1021/jm300763w
BindingDB Entry DOI: 10.7270/Q2WS8VCX
Cannabinoid receptor 2
(Homo sapiens (Human))
BDBM50395142
(CHEMBL2163579)
Show SMILES CC[C@@H]1COc2cccc3c2n1cc(C(=O)NC12CC4CC(CC(C4)C1)C2)c3=O |r,THB:22:21:18:24.23.25,22:23:20.21.26:18,25:23:20:26.17.18,25:17:20:24.22.23|
Show InChI InChI=1S/C24H28N2O3/c1-2-17-13-29-20-5-3-4-18-21(20)26(17)12-19(22(18)27)23(28)25-24-9-14-6-15(10-24)8-16(7-14)11-24/h3-5,12,14-17H,2,6-11,13H2,1H3,(H,25,28)/t14?,15?,16?,17-,24?/m1/s1
Reactome pathway
n/an/a 18.1n/an/an/an/an/an/a
Universit£ di Ferrara
Curated by ChEMBL
Assay Description
Agonist activity at human recombinant CB2 receptor expressed in CHO cell membranes assessed as inhibition of forskolin-induced cAMP accumulation
J Med Chem 55: 6608-23 (2012)
Article DOI: 10.1021/jm300763w
BindingDB Entry DOI: 10.7270/Q2WS8VCX