BDBM50396297 CHEMBL2172490
SMILES: Cc1cc(on1)-c1ccc2nc(Nc3ccn[nH]3)c(-c3nc(C)nc(N)n3)n2c1
InChI Key: InChIKey=INKMULYTOXUNTN-UHFFFAOYSA-N
Data: 2 IC50
Activity Spreadsheet -- Enzyme Inhibition Constant Data from BindingDB
Found 2 hits for monomerid = 50396297
Trg + Lig
Ki
nM
ΔG°
kcal/mole
IC50
nM
Kd
nM
EC50/IC50
nM
koff
s-1
kon
M-1s-1
pHTemp
°C
Serine/threonine-protein kinase mTOR
(Homo sapiens (Human))
BDBM50396297
(CHEMBL2172490)
Show SMILES Cc1cc(on1)-c1ccc2nc(Nc3ccn[nH]3)c(-c3nc(C)nc(N)n3)n2c1
Show InChI InChI=1S/C18H16N10O/c1-9-7-12(29-27-9)11-3-4-14-24-17(23-13-5-6-20-26-13)15(28(14)8-11)16-21-10(2)22-18(19)25-16/h3-8H,1-2H3,(H2,20,23,26)(H2,19,21,22,25)
NCI pathway
Reactome pathway
n/an/a 3n/an/an/an/an/an/a
Amgen Inc.
Curated by ChEMBL
Assay Description
Inhibition of mTOR by LanthaScreen assay
Bioorg Med Chem Lett 22: 4967-74 (2012)
Article DOI: 10.1016/j.bmcl.2012.06.033
BindingDB Entry DOI: 10.7270/Q2BK1DHN
Phosphatidylinositol 4,5-bisphosphate 3-kinase catalytic subunit alpha isoform
(Homo sapiens (Human))
BDBM50396297
(CHEMBL2172490)
Show SMILES Cc1cc(on1)-c1ccc2nc(Nc3ccn[nH]3)c(-c3nc(C)nc(N)n3)n2c1
Show InChI InChI=1S/C18H16N10O/c1-9-7-12(29-27-9)11-3-4-14-24-17(23-13-5-6-20-26-13)15(28(14)8-11)16-21-10(2)22-18(19)25-16/h3-8H,1-2H3,(H2,20,23,26)(H2,19,21,22,25)
NCI pathway
Reactome pathway
n/an/a 177n/an/an/an/an/an/a
Amgen Inc.
Curated by ChEMBL
Assay Description
Inhibition of PI3Kalpha by AlphaScreen assay
Bioorg Med Chem Lett 22: 4967-74 (2012)
Article DOI: 10.1016/j.bmcl.2012.06.033
BindingDB Entry DOI: 10.7270/Q2BK1DHN