BDBM50396915 CHEMBL2170781
SMILES: CC(C)C[C@H](NC(=O)[C@H](CC(C)C)NC(=O)[C@@H](Cc1c[nH]c2ccccc12)NC(=O)[C@H](Cc1ccccc1)NC(=O)[C@@H](Cc1cccc2ccccc12)NC(=O)[C@@H](N)CCCCN)C(N)=O
InChI Key: InChIKey=NCMQVOQOKBIHPA-MHRDGXECSA-N
Data: 2 KI  3 EC50
Activity Spreadsheet -- Enzyme Inhibition Constant Data from BindingDB
Found 6 hits for monomerid = 50396915
Trg + Lig
Ki
nM
ΔG°
kcal/mole
IC50
nM
Kd
nM
EC50/IC50
nM
koff
s-1
kon
M-1s-1
pHTemp
°C
Ghrelin receptor
(Homo sapiens (Human))
BDBM50396915
(CHEMBL2170781)
Show SMILES CC(C)C[C@H](NC(=O)[C@H](CC(C)C)NC(=O)[C@@H](Cc1c[nH]c2ccccc12)NC(=O)[C@H](Cc1ccccc1)NC(=O)[C@@H](Cc1cccc2ccccc12)NC(=O)[C@@H](N)CCCCN)C(N)=O |r|
Show InChI InChI=1S/C51H67N9O6/c1-31(2)25-41(46(54)61)56-48(63)42(26-32(3)4)58-51(66)45(29-36-30-55-40-23-11-10-21-38(36)40)60-49(64)43(27-33-15-6-5-7-16-33)59-50(65)44(57-47(62)39(53)22-12-13-24-52)28-35-19-14-18-34-17-8-9-20-37(34)35/h5-11,14-21,23,30-32,39,41-45,55H,12-13,22,24-29,52-53H2,1-4H3,(H2,54,61)(H,56,63)(H,57,62)(H,58,66)(H,59,65)(H,60,64)/t39-,41-,42-,43-,44+,45+/m0/s1
Reactome pathway
3.70n/an/an/an/an/an/an/an/a
Universit£ de Montpellier
Curated by ChEMBL
Assay Description
Displacement of [125I]-His9 ghrelin from SNAP-tagged human GHSR expressed in HEK293T cells after 3 hrs by HTRF assay
J Med Chem 62: 965-973 (2019)
Article DOI: 10.1021/acs.jmedchem.8b01644
Ghrelin receptor
(Homo sapiens (Human))
BDBM50396915
(CHEMBL2170781)
Show SMILES CC(C)C[C@H](NC(=O)[C@H](CC(C)C)NC(=O)[C@@H](Cc1c[nH]c2ccccc12)NC(=O)[C@H](Cc1ccccc1)NC(=O)[C@@H](Cc1cccc2ccccc12)NC(=O)[C@@H](N)CCCCN)C(N)=O |r|
Show InChI InChI=1S/C51H67N9O6/c1-31(2)25-41(46(54)61)56-48(63)42(26-32(3)4)58-51(66)45(29-36-30-55-40-23-11-10-21-38(36)40)60-49(64)43(27-33-15-6-5-7-16-33)59-50(65)44(57-47(62)39(53)22-12-13-24-52)28-35-19-14-18-34-17-8-9-20-37(34)35/h5-11,14-21,23,30-32,39,41-45,55H,12-13,22,24-29,52-53H2,1-4H3,(H2,54,61)(H,56,63)(H,57,62)(H,58,66)(H,59,65)(H,60,64)/t39-,41-,42-,43-,44+,45+/m0/s1
Reactome pathway
4.90n/an/an/an/an/an/an/an/a
Universit£t Leipzig
Curated by ChEMBL
Assay Description
Displacement of [125I]-His-ghrelin from human ghrelin receptor expressed in COS7 cells incubated for 75 mins by scintillation counting based assay
J Med Chem 55: 7437-49 (2012)
Article DOI: 10.1021/jm300414b
BindingDB Entry DOI: 10.7270/Q26M37Z8
Ghrelin receptor
(Homo sapiens (Human))
BDBM50396915
(CHEMBL2170781)
Show SMILES CC(C)C[C@H](NC(=O)[C@H](CC(C)C)NC(=O)[C@@H](Cc1c[nH]c2ccccc12)NC(=O)[C@H](Cc1ccccc1)NC(=O)[C@@H](Cc1cccc2ccccc12)NC(=O)[C@@H](N)CCCCN)C(N)=O |r|
Show InChI InChI=1S/C51H67N9O6/c1-31(2)25-41(46(54)61)56-48(63)42(26-32(3)4)58-51(66)45(29-36-30-55-40-23-11-10-21-38(36)40)60-49(64)43(27-33-15-6-5-7-16-33)59-50(65)44(57-47(62)39(53)22-12-13-24-52)28-35-19-14-18-34-17-8-9-20-37(34)35/h5-11,14-21,23,30-32,39,41-45,55H,12-13,22,24-29,52-53H2,1-4H3,(H2,54,61)(H,56,63)(H,57,62)(H,58,66)(H,59,65)(H,60,64)/t39-,41-,42-,43-,44+,45+/m0/s1
Reactome pathway
n/an/an/an/a 12n/an/an/an/a
TBA
Citation and Details
Ghrelin receptor
(Homo sapiens (Human))
BDBM50396915
(CHEMBL2170781)
Show SMILES CC(C)C[C@H](NC(=O)[C@H](CC(C)C)NC(=O)[C@@H](Cc1c[nH]c2ccccc12)NC(=O)[C@H](Cc1ccccc1)NC(=O)[C@@H](Cc1cccc2ccccc12)NC(=O)[C@@H](N)CCCCN)C(N)=O |r|
Show InChI InChI=1S/C51H67N9O6/c1-31(2)25-41(46(54)61)56-48(63)42(26-32(3)4)58-51(66)45(29-36-30-55-40-23-11-10-21-38(36)40)60-49(64)43(27-33-15-6-5-7-16-33)59-50(65)44(57-47(62)39(53)22-12-13-24-52)28-35-19-14-18-34-17-8-9-20-37(34)35/h5-11,14-21,23,30-32,39,41-45,55H,12-13,22,24-29,52-53H2,1-4H3,(H2,54,61)(H,56,63)(H,57,62)(H,58,66)(H,59,65)(H,60,64)/t39-,41-,42-,43-,44+,45+/m0/s1
Reactome pathway
n/an/an/an/a 3.40n/an/an/an/a
Universit£t Leipzig
Curated by ChEMBL
Assay Description
Inverse agonist activity at human ghrelin receptor expressed in COS 7 cells using [2-3H]myo-inositol by inositol triphosphate turnover assay
J Med Chem 55: 7437-49 (2012)
Article DOI: 10.1021/jm300414b
BindingDB Entry DOI: 10.7270/Q26M37Z8
Ghrelin receptor
(Homo sapiens (Human))
BDBM50396915
(CHEMBL2170781)
Show SMILES CC(C)C[C@H](NC(=O)[C@H](CC(C)C)NC(=O)[C@@H](Cc1c[nH]c2ccccc12)NC(=O)[C@H](Cc1ccccc1)NC(=O)[C@@H](Cc1cccc2ccccc12)NC(=O)[C@@H](N)CCCCN)C(N)=O |r|
Show InChI InChI=1S/C51H67N9O6/c1-31(2)25-41(46(54)61)56-48(63)42(26-32(3)4)58-51(66)45(29-36-30-55-40-23-11-10-21-38(36)40)60-49(64)43(27-33-15-6-5-7-16-33)59-50(65)44(57-47(62)39(53)22-12-13-24-52)28-35-19-14-18-34-17-8-9-20-37(34)35/h5-11,14-21,23,30-32,39,41-45,55H,12-13,22,24-29,52-53H2,1-4H3,(H2,54,61)(H,56,63)(H,57,62)(H,58,66)(H,59,65)(H,60,64)/t39-,41-,42-,43-,44+,45+/m0/s1
Reactome pathway
n/an/an/an/a 5.5n/an/an/an/a
Universit£ de Montpellier
Curated by ChEMBL
Assay Description
Inverse agonist activity at SNAP-tagged human GHSR expressed in HEK293T cells assessed as reduction in inositol phosphate production after 30 mins by...
J Med Chem 62: 965-973 (2019)
Article DOI: 10.1021/acs.jmedchem.8b01644
Ghrelin receptor
(Homo sapiens (Human))
BDBM50396915
(CHEMBL2170781)
Show SMILES CC(C)C[C@H](NC(=O)[C@H](CC(C)C)NC(=O)[C@@H](Cc1c[nH]c2ccccc12)NC(=O)[C@H](Cc1ccccc1)NC(=O)[C@@H](Cc1cccc2ccccc12)NC(=O)[C@@H](N)CCCCN)C(N)=O |r|
Show InChI InChI=1S/C51H67N9O6/c1-31(2)25-41(46(54)61)56-48(63)42(26-32(3)4)58-51(66)45(29-36-30-55-40-23-11-10-21-38(36)40)60-49(64)43(27-33-15-6-5-7-16-33)59-50(65)44(57-47(62)39(53)22-12-13-24-52)28-35-19-14-18-34-17-8-9-20-37(34)35/h5-11,14-21,23,30-32,39,41-45,55H,12-13,22,24-29,52-53H2,1-4H3,(H2,54,61)(H,56,63)(H,57,62)(H,58,66)(H,59,65)(H,60,64)/t39-,41-,42-,43-,44+,45+/m0/s1
Reactome pathway
n/an/an/an/a 3.80n/an/an/an/a
Universit£t Leipzig
Curated by ChEMBL
Assay Description
Inverse agonist activity at FLAG-tagged human ghrelin receptor expressed in COS 7 cells using [2-3H]myo-inositol by inositol triphosphate turnover as...
J Med Chem 55: 7437-49 (2012)
Article DOI: 10.1021/jm300414b
BindingDB Entry DOI: 10.7270/Q26M37Z8