BDBM50397846 CHEMBL2179098
SMILES: C[C@@H]1CN(Cc2ccccc2F)C[C@H]1c1nc2n(ncc2c(=O)[nH]1)C1CCOCC1
InChI Key: InChIKey=FVSFTKVUXVUPHI-RDTXWAMCSA-N
Data: 2 IC50
Activity Spreadsheet -- Enzyme Inhibition Constant Data from BindingDB
Found 2 hits for monomerid = 50397846
Trg + Lig
Ki
nM
ΔG°
kcal/mole
IC50
nM
Kd
nM
EC50/IC50
nM
koff
s-1
kon
M-1s-1
pHTemp
°C
Phosphodiesterase 9A
(Homo sapiens (Human))
BDBM50397846
(CHEMBL2179098)
Show SMILES C[C@@H]1CN(Cc2ccccc2F)C[C@H]1c1nc2n(ncc2c(=O)[nH]1)C1CCOCC1 |r|
Show InChI InChI=1S/C22H26FN5O2/c1-14-11-27(12-15-4-2-3-5-19(15)23)13-18(14)20-25-21-17(22(29)26-20)10-24-28(21)16-6-8-30-9-7-16/h2-5,10,14,16,18H,6-9,11-13H2,1H3,(H,25,26,29)/t14-,18-/m1/s1
n/an/a 4.60n/an/an/an/an/an/a
Pfizer Inc.
Curated by ChEMBL
Assay Description
Inhibition of human recombinant PDE9A expressed in Sf9 cells using [3H]cGMP as substrate after 30 mins by scintillation proximity assay
J Med Chem 55: 9045-54 (2012)
Article DOI: 10.1021/jm3007799
BindingDB Entry DOI: 10.7270/Q24J0G79
Calcium/calmodulin-dependent 3',5'-cyclic nucleotide phosphodiesterase 1C
(Homo sapiens (Human))
BDBM50397846
(CHEMBL2179098)
Show SMILES C[C@@H]1CN(Cc2ccccc2F)C[C@H]1c1nc2n(ncc2c(=O)[nH]1)C1CCOCC1 |r|
Show InChI InChI=1S/C22H26FN5O2/c1-14-11-27(12-15-4-2-3-5-19(15)23)13-18(14)20-25-21-17(22(29)26-20)10-24-28(21)16-6-8-30-9-7-16/h2-5,10,14,16,18H,6-9,11-13H2,1H3,(H,25,26,29)/t14-,18-/m1/s1
n/an/a 889n/an/an/an/an/an/a
Pfizer Inc.
Curated by ChEMBL
Assay Description
Inhibition of human recombinant PDE1C expressed in Sf9 cells using [3H]cAMP as substrate after 30 mins by scintillation proximity assay
J Med Chem 55: 9045-54 (2012)
Article DOI: 10.1021/jm3007799
BindingDB Entry DOI: 10.7270/Q24J0G79