BDBM50398361 CHEMBL2177372
SMILES: CC(C)NC[C@@H](C(=O)N1CCN(CC1)c1ncnc2[C@H](O)C[C@@H](C)c12)c1ccc(Cl)c(F)c1
InChI Key: InChIKey=ACYVWONXYYNPDK-WRWLIDTKSA-N
Data: 4 IC50
Activity Spreadsheet -- Enzyme Inhibition Constant Data from BindingDB
Found 4 hits for monomerid = 50398361
Trg + Lig
Ki
nM
ΔG°
kcal/mole
IC50
nM
Kd
nM
EC50/IC50
nM
koff
s-1
kon
M-1s-1
pHTemp
°C
RAC-alpha serine/threonine-protein kinase
(Homo sapiens (Human))
BDBM50398361
(CHEMBL2177372)
Show SMILES CC(C)NC[C@@H](C(=O)N1CCN(CC1)c1ncnc2[C@H](O)C[C@@H](C)c12)c1ccc(Cl)c(F)c1 |r|
Show InChI InChI=1S/C24H31ClFN5O2/c1-14(2)27-12-17(16-4-5-18(25)19(26)11-16)24(33)31-8-6-30(7-9-31)23-21-15(3)10-20(32)22(21)28-13-29-23/h4-5,11,13-15,17,20,27,32H,6-10,12H2,1-3H3/t15-,17-,20-/m1/s1
n/an/a 3n/an/an/an/an/an/a
Array BioPharma Inc.
Curated by ChEMBL
Assay Description
Competitive inhibition of wild-type full-length amino-terminal polyhistidine-tagged human Akt1 expressed in recombinant baculovirus system using fluo...
J Med Chem 55: 8110-27 (2012)
Article DOI: 10.1021/jm301024w
BindingDB Entry DOI: 10.7270/Q20P1160
Serine/threonine-protein kinase AKT2
(Homo sapiens (Human))
BDBM50398361
(CHEMBL2177372)
Show SMILES CC(C)NC[C@@H](C(=O)N1CCN(CC1)c1ncnc2[C@H](O)C[C@@H](C)c12)c1ccc(Cl)c(F)c1 |r|
Show InChI InChI=1S/C24H31ClFN5O2/c1-14(2)27-12-17(16-4-5-18(25)19(26)11-16)24(33)31-8-6-30(7-9-31)23-21-15(3)10-20(32)22(21)28-13-29-23/h4-5,11,13-15,17,20,27,32H,6-10,12H2,1-3H3/t15-,17-,20-/m1/s1
n/an/a 17n/an/an/an/an/an/a
Array BioPharma Inc.
Curated by ChEMBL
Assay Description
Competitive inhibition of wild-type full-length amino-terminal polyhistidine-tagged human Akt2 expressed in recombinant baculovirus system using fluo...
J Med Chem 55: 8110-27 (2012)
Article DOI: 10.1021/jm301024w
BindingDB Entry DOI: 10.7270/Q20P1160
Serine/threonine-protein kinase AKT
(Homo sapiens (Human))
BDBM50398361
(CHEMBL2177372)
Show SMILES CC(C)NC[C@@H](C(=O)N1CCN(CC1)c1ncnc2[C@H](O)C[C@@H](C)c12)c1ccc(Cl)c(F)c1 |r|
Show InChI InChI=1S/C24H31ClFN5O2/c1-14(2)27-12-17(16-4-5-18(25)19(26)11-16)24(33)31-8-6-30(7-9-31)23-21-15(3)10-20(32)22(21)28-13-29-23/h4-5,11,13-15,17,20,27,32H,6-10,12H2,1-3H3/t15-,17-,20-/m1/s1
NCI pathway
Reactome pathway
n/an/a 7n/an/an/an/an/an/a
Array BioPharma Inc.
Curated by ChEMBL
Assay Description
Competitive inhibition of wild-type full-length amino-terminal polyhistidine-tagged human Akt3 expressed in recombinant baculovirus system using fluo...
J Med Chem 55: 8110-27 (2012)
Article DOI: 10.1021/jm301024w
BindingDB Entry DOI: 10.7270/Q20P1160
RAC-alpha serine/threonine-protein kinase
(Homo sapiens (Human))
BDBM50398361
(CHEMBL2177372)
Show SMILES CC(C)NC[C@@H](C(=O)N1CCN(CC1)c1ncnc2[C@H](O)C[C@@H](C)c12)c1ccc(Cl)c(F)c1 |r|
Show InChI InChI=1S/C24H31ClFN5O2/c1-14(2)27-12-17(16-4-5-18(25)19(26)11-16)24(33)31-8-6-30(7-9-31)23-21-15(3)10-20(32)22(21)28-13-29-23/h4-5,11,13-15,17,20,27,32H,6-10,12H2,1-3H3/t15-,17-,20-/m1/s1
n/an/a 234n/an/an/an/an/an/a
Array BioPharma Inc.
Curated by ChEMBL
Assay Description
Competitive inhibition of wild-type full-length amino-terminal polyhistidine-tagged human Akt1 expressed in recombinant baculovirus system using fluo...
J Med Chem 55: 8110-27 (2012)
Article DOI: 10.1021/jm301024w
BindingDB Entry DOI: 10.7270/Q20P1160