BDBM50401331 CHEMBL2205231
SMILES: COc1c(C(=O)NC2CCN(CC2)C(=O)CO)n(C)c2c3CCCCc3n(CC(=O)c3ccccc3)c(=O)c12
InChI Key: InChIKey=LCDSXPOUDBLIAX-UHFFFAOYSA-N
Data: 1 IC50
Activity Spreadsheet -- Enzyme Inhibition Constant Data from BindingDB
Found 1 hit for monomerid = 50401331
Trg + Lig
Ki
nM
ΔG°
kcal/mole
IC50
nM
Kd
nM
EC50/IC50
nM
koff
s-1
kon
M-1s-1
pHTemp
°C
Sonic hedgehog protein
(Mus musculus (Mouse))
BDBM50401331
(CHEMBL2205231)
Show SMILES COc1c(C(=O)NC2CCN(CC2)C(=O)CO)n(C)c2c3CCCCc3n(CC(=O)c3ccccc3)c(=O)c12
Show InChI InChI=1S/C29H34N4O6/c1-31-25-20-10-6-7-11-21(20)33(16-22(35)18-8-4-3-5-9-18)29(38)24(25)27(39-2)26(31)28(37)30-19-12-14-32(15-13-19)23(36)17-34/h3-5,8-9,19,34H,6-7,10-17H2,1-2H3,(H,30,37)
n/an/a 96n/an/an/an/an/an/a
Takeda Pharmaceutical Company Limited
Curated by ChEMBL
Assay Description
Inhibition of recombinant mouse Shh-N expressed in mouse NIH3T3/Gli-luc cells assessed as inhibition of Gli1 expression after 48 hrs by luciferase re...
Bioorg Med Chem 20: 5507-17 (2012)
Article DOI: 10.1016/j.bmc.2012.07.034
BindingDB Entry DOI: 10.7270/Q2ZS2XP4